by

Where communities thrive


  • Join over 1.5M+ people
  • Join over 100K+ communities
  • Free without limits
  • Create your own community
People
Activity
  • Nov 14 2019 13:32
    romitkarmakar commented #33
  • Nov 13 2019 12:13
    pandusonu2 commented #41
  • Nov 13 2019 12:13

    pandusonu2 on master

    Added Logo and Updated proposal… (compare)

  • Nov 13 2019 12:13
    pandusonu2 closed #41
  • Nov 13 2019 09:27
    romitkarmakar review_requested #41
  • Nov 13 2019 09:27
    romitkarmakar review_requested #41
  • Nov 13 2019 09:27
    romitkarmakar synchronize #41
  • Nov 12 2019 09:18
    romitkarmakar review_requested #41
  • Nov 12 2019 09:15
    romitkarmakar synchronize #41
  • Nov 12 2019 04:09
    pandusonu2 commented #41
  • Nov 12 2019 03:58
    ZER-0-NE commented #41
  • Nov 12 2019 03:35
    pandusonu2 commented #41
  • Nov 11 2019 13:24
    ZER-0-NE commented #41
  • Nov 11 2019 07:19
    pandusonu2 commented #41
  • Nov 10 2019 18:49
    romitkarmakar review_requested #41
  • Jun 12 2019 16:02
    romitkarmakar commented #41
  • Jun 12 2019 15:59
    romitkarmakar synchronize #41
  • Jun 12 2019 15:32
    ananyo2012 commented #40
  • Jun 12 2019 08:29
    pandusonu2 commented #41
  • Jun 12 2019 07:24
    ZER-0-NE commented #41
SVS HARSHITH
@harshith331
@v-rohan it's working .. there might be internet issue so try again, if not build the project again and get back to me if the issue is still there
V. Rohan Rao
@v-rohan
okay, @harshith331
Anushka7479
@Anushka7479
@anupamdas43345 there is nothing like how many you have to solve ,solve as many as possible in case you think there must be some other improvements open an issue and contribute and in case of any problem ping me back
anupamdas43345
@anupamdas43345
Ok Didi
ricky1812
@ricky1812
@archi-007 you have uploaded same files twice. There s a error. https://stackoverflow.com/questions/11485271/google-oauth-2-authorization-error-redirect-uri-mismatch. Check this for references.
Archisman Ghosh
@archi-007
P
The uri is matched with localhost:8000 and not 127.0.0.1:8000 hence it is showing the error.
Should I include it in the readme?
ricky1812
@ricky1812
@archi-007 change it to 127.0.01:8000 and try to add other login options also
Pratik Dey
@Pratikrocks

I forked , and cloned the project https://github.com/lugnitdgp/Attendancetracking ,Then in frontend directory running :yarn run in dev mode is showing me the error:
ERROR in ./src/index.jsx
Module build failed: SyntaxError: Unexpected token (26:6)

24 | var pagecontainer=[];
25 | pagecontainer.push(

26 | <div>
| ^
27 | <Attendance />
28 | </div>
29 | )

and the build fails ,
what is the solution for this error?

Nirvik Agarwal
@nirvikagarwal
I am working on the instagram project. I have already sent a pull request regarding the improvement of UI. I am so interested in adding a profile image
If I want to add
Profile image field in the signup page do I need to use the abstract user class for it
ricky1812
@ricky1812
@nirvikagarwal you don't need to do that..
Abhisheksharma782000
@Abhisheksharma782000
hi
Naveen Reddy
@naveenreddy2000
@Pratikrocks
Naveen Reddy
@naveenreddy2000
Install http-server
And run http-server in frontend directory
Yash Vardhan
@Error-200

Built at: 01/25/2020 12:25:40 PM
Asset Size Chunks Chunk Names
main.bundle.js 319 KiB main [emitted] main
Entrypoint main = main.bundle.js
[0] multi ./js/index.js 28 bytes {main} [built]
[./js/index.js] 93 bytes {main} [built]
[./js/src/Button.js] 91 bytes {main} [built]
[./js/src/Form.js] 321 bytes {main} [built]
[./js/src/alertBox.js] 733 bytes {main} [built]
[./js/src/quizCard.js] 179 bytes {main} [built]

+ 1 hidden module

events.js:174
throw er; // Unhandled 'error' event
^

Error: spawn /Users/yashvardhanprasad/Desktop/Metal_UI-master/node_modules/hugo-bin/vendor/hugo ENOENT
at Process.ChildProcess._handle.onexit (internal/child_process.js:240:19)
at onErrorNT (internal/child_process.js:415:16)
at process._tickCallback (internal/process/next_tick.js:63:19)
at Function.Module.runMain (internal/modules/cjs/loader.js:832:11)
at startup (internal/bootstrap/node.js:283:19)
at bootstrapNodeJSCore (internal/bootstrap/node.js:622:3)
Emitted 'error' event at:
at Process.ChildProcess._handle.onexit (internal/child_process.js:246:12)
at onErrorNT (internal/child_process.js:415:16)
[... lines matching original stack trace ...]
at bootstrapNodeJSCore (internal/bootstrap/node.js:622:3)
npm ERR! code ELIFECYCLE
npm ERR! errno 1
npm ERR! metal@1.0.0 server: webpack --mode development && hugo server --source site/
npm ERR! Exit status 1
npm ERR!
npm ERR! Failed at the metal@1.0.0 server script.
npm ERR! This is probably not a problem with npm. There is likely additional logging output above.

npm ERR! A complete log of this run can be found in:
npm ERR! /Users/yashvardhanprasad/.npm/_logs/2020-01-25T06_55_40_165Z-debug.log
[nodemon] app crashed - waiting for file changes before starting...

can you help with this error ?

from METAL UI
Pratik Dey
@Pratikrocks
@naveenreddy2000,I have http-server inastalled but as per the docs in the frontend directory,we must first run :yarn run to run in development mode (build is failing even now due to the above mention exceptions) ,though I ran http-server in the cmd and by heading to the local Host 8000 is showing unable to connect to local host
Avinash Agarwal
@AvinashAgarwal14
@all As you know the deadline to submit the proposal is today, so try to get your proposal reviewed by your mentor before submitting it. For those who have just started don't wory about getting your proposal reviewed, select a project and an unassigned issue and draft a propsal, if the competition is less in that project you might get selected (what actually happens in GSoC)!
All the best!
Sucharu Rai
@SucharuRai
@Error-200 I shall DM you about that
abhijitroy1024
@abhijitroy1024
(environment) root@kali:~/gitrepo/Codeara# pip3 install -r requirements.txt
Collecting appdirs==1.4.3
Using cached appdirs-1.4.3-py2.py3-none-any.whl (12 kB)
ERROR: Could not find a version that satisfies the requirement apturl==0.5.2 (from -r requirements.txt (line 2)) (from versions: none)
ERROR: No matching distribution found for apturl==0.5.2 (from -r requirements.txt (line 2))
(environment) root@kali:~/gitrepo/Codeara# pip3 install -r requirements.txt
Collecting appdirs==1.4.3
Using cached appdirs-1.4.3-py2.py3-none-any.whl (12 kB)
ERROR: Could not find a version that satisfies the requirement apturl==0.5.2 (from -r requirements.txt (line 2)) (from versions: none)
ERROR: No matching distribution found for apturl==0.5.2 (from -r requirements.txt (line 2))
Sampark Sharma
@Phantsure
Try removing the version from requirements.txt file of apturl
abhijitroy1024
@abhijitroy1024
There are so many versions which are not installing such as Brlapi,apturl,command-not-found,cupshelpers so i m removing all those versions from requiements.txt ?
Naveen Reddy
@naveenreddy2000
@Pratikrocks just run http-server by following the readme instructions in frontend directory.It opens the app probably on port 8080.
V. Rohan Rao
@v-rohan
@harshith331 I've made a PR. Please, kindly review it.
Nirvik Agarwal
@nirvikagarwal
@ricky1812 I am made a PR. Please review it
akash2099
@akash2099
Hi
SVS HARSHITH
@harshith331
@v-rohan okay
Sampark Sharma
@Phantsure
@abhijitroy1024 which ever is not installing remove the version of those including the "==". Eg. "apturl==0.5.2" -> "apturl". I would recommend dont remove versions for all.
Himanshu Shekhar
@himanshu272
Hello @akash2099 . Please write a proposal for GSoC Heat and upload it. Even if you have not worked on any project yet, you can decide which issue you want to work on and write that down.
abhijitroy1024
@abhijitroy1024
@Phantsure

@Phantsure Building wheel for pycairo (setup.py) ... error
ERROR: Command errored out with exit status 1:
command: /root/gitrepo/environment/bin/python3 -u -c 'import sys, setuptools, tokenize; sys.argv[0] = '"'"'/tmp/pip-install-qbcspz1j/pycairo/setup.py'"'"'; file='"'"'/tmp/pip-install-qbcspz1j/pycairo/setup.py'"'"';f=getattr(tokenize, '"'"'open'"'"', open)(file);code=f.read().replace('"'"'\r\n'"'"', '"'"'\n'"'"');f.close();exec(compile(code, file, '"'"'exec'"'"'))' bdist_wheel -d /tmp/pip-wheel-st1tkpng
cwd: /tmp/pip-install-qbcspz1j/pycairo/
Complete output (10 lines):
running bdist_wheel
running build
running build_py
creating build
creating build/lib.linux-x86_64-3.7
creating build/lib.linux-x86_64-3.7/cairo
copying cairo/init.py -> build/lib.linux-x86_64-3.7/cairo
running build_ext
'pkg-config' not found.

Command ['pkg-config', '--print-errors', '--exists', 'cairo >= 1.13.1']

ERROR: Failed building wheel for pycairo
Running setup.py clean for pycairo
Building wheel for pycups (setup.py) ... error
ERROR: Command errored out with exit status 1:
command: /root/gitrepo/environment/bin/python3 -u -c 'import sys, setuptools, tokenize; sys.argv[0] = '"'"'/tmp/pip-install-qbcspz1j/pycups/setup.py'"'"'; file='"'"'/tmp/pip-install-qbcspz1j/pycups/setup.py'"'"';f=getattr(tokenize, '"'"'open'"'"', open)(file);code=f.read().replace('"'"'\r\n'"'"', '"'"'\n'"'"');f.close();exec(compile(code, file, '"'"'exec'"'"'))' bdist_wheel -d /tmp/pip-wheel-eva9cey6
cwd: /tmp/pip-install-qbcspz1j/pycups/
Complete output (12 lines):
running bdist_wheel
running build
running build_ext
building 'cups' extension
creating build
creating build/temp.linux-x86_64-3.7

Sampark Sharma
@Phantsure
what is your project?
abhijitroy1024
@abhijitroy1024
codeara
abhijitroy1024
@abhijitroy1024
@Phantsure UndefinedValueError: SECRET_KEY not found. Declare it as envvar or define a default value.
Rohit Shukla
@rohitsh16
Hello @abhijitroy1024
Have you build the project to your local machine?
Create .env
Sampark Sharma
@Phantsure
cp .env.example .env
abhijitroy1024
@abhijitroy1024
it is showing UndefinedValueError: SECRET_KEY not found. Declare it as envvar or define a default value
where do i create my .env file ? root folder or virtualenv
Rohit Shukla
@rohitsh16
Create .env file inside the project
Sampark Sharma
@Phantsure
root in virtualenv
Rohit Shukla
@rohitsh16
Just go inside the project and do cp .env.example .env
abhijitroy1024
@abhijitroy1024
@rohitsh16 it is running in my local machine ....