These are chat archives for TimDurward/reepio

25th
Apr 2015
bluenevus
@bluenevus
Apr 25 2015 18:19
hello
Tim Durward
@TimDurward
Apr 25 2015 18:19
Hey blue, have you checked if your node and npm are up to date
as well as grunt
bluenevus
@bluenevus
Apr 25 2015 18:20
I have not check grunt yet
i'm checking now
node v0.12.0
npm 2.5.1
still checking grung
grunt
Tim Durward
@TimDurward
Apr 25 2015 18:21
your node needs to be updated to 0.12.2
bluenevus
@bluenevus
Apr 25 2015 18:22
the command grunt -v doesn't show me the version
Tim Durward
@TimDurward
Apr 25 2015 18:23
Well my node and npm are setup to latest updates. This could possibly be the problem
bluenevus
@bluenevus
Apr 25 2015 18:23
ok. I'm trying to update node now
Tim Durward
@TimDurward
Apr 25 2015 18:24
reepio was using 4 or 5 month old versions! :P
also you should check if grunt is installed. If it is typing grunt should display versions
bluenevus
@bluenevus
Apr 25 2015 18:29
ok upgraded
Tim Durward
@TimDurward
Apr 25 2015 18:29
what does npm -v | node -v display
bluenevus
@bluenevus
Apr 25 2015 18:29
grunt says not found but I did an npm install grunt and it worked
npm 2.7.4
node 0.12.2
Tim Durward
@TimDurward
Apr 25 2015 18:31
did you try npm start under ../reepio
bluenevus
@bluenevus
Apr 25 2015 18:31
yes
no change
same errors
Tim Durward
@TimDurward
Apr 25 2015 18:31
What are the console errors
bluenevus
@bluenevus
Apr 25 2015 18:32
no error on npm start but error on npm test here
INFO [karma]: Karma v0.10.10 server started at http://localhost:9876/
INFO [launcher]: Starting browser Chrome
ERROR [karma]: [TypeError: Cannot read property 'charAt' of undefined]
TypeError: Cannot read property 'charAt' of undefined
at Object.posix.isAbsolute (path.js:479:14)
at Object.posix.normalize (path.js:461:26)
at Object._getCommand (/usr/share/reepio/node_modules/karma/lib/launchers/Base.js:106:20)
at Object._start (/usr/share/reepio/node_modules/karma/lib/launchers/Base.js:45:28)
at Object.start (/usr/share/reepio/node_modules/karma/lib/launchers/Base.js:36:10)
at /usr/share/reepio/node_modules/karma/lib/launcher.js:38:15
at Array.forEach (native)
at launch (/usr/share/reepio/node_modules/karma/lib/launcher.js:12:11)
at invoke (/usr/share/reepio/node_modules/karma/node_modules/di/lib/injector.js:75:15)
at Server.<anonymous> (/usr/share/reepio/node_modules/karma/lib/server.js:54:16)
at Server.g (events.js:199:16)
at Server.emit (events.js:129:20)
at net.js:1161:12
at process._tickCallback (node.js:355:11)
at Function.Module.runMain (module.js:503:11)
at startup (node.js:129:16)
at node.js:814:3
npm ERR! Test failed. See above for more details.
Tim Durward
@TimDurward
Apr 25 2015 18:33
Ok I'm looking into this
bluenevus
@bluenevus
Apr 25 2015 18:34
I just removed reepio, I just did a git clone and just ran npm install
its reinstalling right now
I'll share the logs
well, there aree some new warnings, imagemin is failing as before
Tim Durward
@TimDurward
Apr 25 2015 18:37
ah one sec, I might know why
are you using terminal wheezy
or gui
bluenevus
@bluenevus
Apr 25 2015 18:39
terminal
there is no gui
Tim Durward
@TimDurward
Apr 25 2015 18:40
npm install karma-phantomjs-launcher --save-dev
don't try anything after thats installed
one sec
bluenevus
@bluenevus
Apr 25 2015 18:43
ok
Tim Durward
@TimDurward
Apr 25 2015 18:45
I've updated my reepio
you might need to start over
bluenevus
@bluenevus
Apr 25 2015 18:46
ok. you want me to reinstall/
Tim Durward
@TimDurward
Apr 25 2015 18:46
Yes please
bluenevus
@bluenevus
Apr 25 2015 18:46
starting all over
ok installing
Tim Durward
@TimDurward
Apr 25 2015 18:46
:)
If it doesn't work there should be some less errors. hopefully
bluenevus
@bluenevus
Apr 25 2015 18:49
here are some warning
npm WARN peerDependencies The peer dependency karma-jasmine@~0.1.0 included from karma will no
npm WARN peerDependencies longer be automatically installed to fulfill the peerDependency
npm WARN peerDependencies in npm 3+. Your application will need to depend on it explicitly.
npm WARN peerDependencies The peer dependency karma-requirejs@~0.2.0 included from karma will no
npm WARN peerDependencies longer be automatically installed to fulfill the peerDependency
npm WARN peerDependencies in npm 3+. Your application will need to depend on it explicitly.
npm WARN peerDependencies The peer dependency karma-coffee-preprocessor@~0.1.0 included from karma will no
npm WARN peerDependencies longer be automatically installed to fulfill the peerDependency
npm WARN peerDependencies in npm 3+. Your application will need to depend on it explicitly.
npm WARN peerDependencies The peer dependency karma-html2js-preprocessor@~0.1.0 included from karma will no
npm WARN peerDependencies longer be automatically installed to fulfill the peerDependency
npm WARN peerDependencies in npm 3+. Your application will need to depend on it explicitly.
npm WARN peerDependencies The peer dependency karma-chrome-launcher@~0.1.0 included from karma will no
npm WARN peerDependencies longer be automatically installed to fulfill the peerDependency
npm WARN peerDependencies in npm 3+. Your application will need to depend on it explicitly.
npm WARN peerDependencies The peer dependency karma-firefox-launcher@~0.1.0 included from karma will no
npm WARN peerDependencies longer be automatically installed to fulfill the peerDependency
npm WARN peerDependencies in npm 3+. Your application will need to depend on it explicitly.
npm WARN peerDependencies The peer dependency karma-phantomjs-launcher@~0.1.0 included from karma will no
npm WARN peerDependencies longer be automatically installed to fulfill the peerDependency
npm WARN peerDependencies in npm 3+. Your application will need to depend on it explicitly.
npm WARN peerDependencies The peer dependency karma-script-launcher@~0.1.0 included from karma will no
npm WARN peerDependencies longer be automatically installed to fulfill the peerDependency
npm WARN peerDependencies in npm 3+. Your application will need to depend on it explicitly
Tim Durward
@TimDurward
Apr 25 2015 18:51
That's just warnings because the modules use peerDependecies in their package.json
have you tried your localhost
bluenevus
@bluenevus
Apr 25 2015 18:51
more logs

npm WARN optional dep failed, continuing fsevents@0.2.1
npm WARN prefer global http-server@0.6.1 should be installed with -g

optipng-bin@0.3.11 postinstall /usr/share/reepio/node_modules/grunt-contrib-imagemin/node_modules/imagemin/node_modules/imagemin-optipng/node_modules/optipng-bin
node index.js

✔ pre-build test passed successfully!

jpegtran-bin@0.2.8 postinstall /usr/share/reepio/node_modules/grunt-contrib-imagemin/node_modules/imagemin/node_modules/imagemin-jpegtran/node_modules/jpegtran-bin
node index.js

✔ pre-build test passed successfully!

gifsicle@0.1.7 postinstall /usr/share/reepio/node_modules/grunt-contrib-imagemin/node_modules/imagemin/node_modules/imagemin-gifsicle/node_modules/gifsicle
node index.js

⚠ pre-build test failed, compiling from source...
stream.js:94
throw er; // Unhandled stream error in pipe.
^
Error: invalid tar file
at Extract.Parse._startEntry (/usr/share/reepio/node_modules/grunt-contrib-imagemin/node_modules/imagemin/node_modules/imagemin-gifsicle/node_modules/gifsicle/node_modules/bin-build/node_modules/download/node_modules/decompress/node_modules/tar/lib/parse.js:145:13)
at Extract.Parse._process (/usr/share/reepio/node_modules/grunt-contrib-imagemin/node_modules/imagemin/node_modules/imagemin-gifsicle/node_modules/gifsicle/node_modules/bin-build/node_modules/download/node_modules/decompress/node_modules/tar/lib/parse.js:127:12)
at BlockStream.<anonymous> (/usr/share/reepio/node_modules/grunt-contrib-imagemin/node_modules/imagemin/node_modules/imagemin-gifsicle/node_modules/gifsicle/node_modules/bin-build/node_modules/download/node_modules/decompress/node_modules/tar/lib/parse.js:47:8)
at BlockStream.emit (events.js:107:17)
at BlockStream._emitChunk (/usr/share/reepio/node_modules/grunt-contrib-imagemin/node_modules/imagemin/node_modules/imagemin-gifsicle/node_modules/gifsicle/node_modules/bin-build/node_modules/download/node_modules/decompress/node_modules/tar/node_modules/block-stream/block-stream.js:145:10)
at BlockStream.resume (/usr/share/reepio/node_modules/grunt-contrib-imagemin/node_modules/imagemin/node_modules/imagemin-gifsicle/node_modules/gifsicle/node_modules/bin-build/node_modules/download/node_modules/decompress/node_modules/tar/node_modules/block-stream/block-stream.js:58:15)
at Extract.Reader.resume (/usr/share/reepio/node_modules/grunt-contrib-imagemin/node_modules/imagemin/node_modules/imagemin-gifsicle/node_modules/gifsicle/node_modules/bin-build/node_modules/download/node_modules/decompress/node_modules/tar/node_modules/fstream/lib/reader.js:255:34)
at DirWriter.<anonymous> (/usr/share/reepio/node_modules/grunt-contrib-imagemin/node_modules/imagemin/node_modules/imagemin-gifsicle/node_modules/gifsicle/node_modules/bin-build/node_modules/download/node_modules/decompress/node_modules/tar/lib/extract.js:57:8)
at DirWriter.emit (events.js:104:17)
at /usr/share/reepio/node_modules/grunt-contrib-imagemin/node_modules/imagemin/node_modules/imagemin-gifsicle/node_modules/gifsicle/node_modules/bin-build/node_modules/download/node_modules/decompress/node_modules/tar/node_modules/fstream/lib/dir-writer.js:39:8

pngquant-bin@0.3.5 postinstall /usr/share/reepio/node_modules/grunt-contrib-imagemin/node_modules/imagemin/node_modules/imagemin-pngquant/node_modules/pngquant-bin
node index.js

⚠ pre-build test failed, compiling from source...
✔ pngquant built successfully!
npm WARN optional dep failed, continuing imagemin-gifsicle@0.1.1
npm ERR! tar.unpack error reading /root/.npm/minimatch/0.3.0/package.tgz

and the last of the erros

npm WARN optional dep failed, continuing imagemin-gifsicle@0.1.1
npm ERR! tar.unpack error reading /root/.npm/minimatch/0.3.0/package.tgz

ws@0.4.32 install /usr/share/reepio/node_modules/karma/node_modules/socket.io/node_modules/socket.io-client/node_modules/ws
(node-gyp rebuild 2> builderror.log) || (exit 0)

make: Entering directory /usr/share/reepio/node_modules/karma/node_modules/socket.io/node_modules/socket.io-client/node_modules/ws/build' CXX(target) Release/obj.target/bufferutil/src/bufferutil.o SOLINK_MODULE(target) Release/obj.target/bufferutil.node SOLINK_MODULE(target) Release/obj.target/bufferutil.node: Finished COPY Release/bufferutil.node CXX(target) Release/obj.target/validation/src/validation.o SOLINK_MODULE(target) Release/obj.target/validation.node SOLINK_MODULE(target) Release/obj.target/validation.node: Finished COPY Release/validation.node make: Leaving directory/usr/share/reepio/node_modules/karma/node_modules/socket.io/node_modules/socket.io-client/node_modules/ws/build'
npm WARN prefer global bower@1.4.1 should be installed with -g
npm WARN prefer global closurecompiler@1.5.1 should be installed with -g

closurecompiler@1.5.1 install /usr/share/reepio/node_modules/closurecompiler
npm run-script configure

/

closurecompiler@1.5.1 configure /usr/share/reepio/node_modules/closurecompiler
node scripts/configure.js

Configuring ClosureCompiler.js 1.5.1 ...

Downloading http://dl.google.com/closure-compiler/compiler-latest.tar.gz ...
| 0 / 5 mb
| 1 / 5 mb
| 2 / 5 mb
| 3 / 5 mb
| 4 / 5 mb
| 5 / 5 mb
✔ Download complete: /usr/share/reepio/node_modules/closurecompiler/compiler/compiler.tar.gz (5 mb)

Unpacking /usr/share/reepio/node_modules/closurecompiler/compiler/compiler.tar.gz ...
| compiler.jar
| COPYING
| README.md
✔ Unpack complete.

Configuring JRE ...
✔ Global Java is available, perfect!

✔ ClosureCompiler.js has successfully been configured!

npm WARN peerDependencies The peer dependency requirejs@~2.1 included from karma-requirejs will no
npm WARN peerDependencies longer be automatically installed to fulfill the peerDependency
npm WARN peerDependencies in npm 3+. Your application will need to depend on it explicitly.
|

phantomjs@1.9.16 install /usr/share/reepio/node_modules/karma-phantomjs-launcher/node_modules/phantomjs
node install.js

Downloading https://bitbucket.org/ariya/phantomjs/downloads/phantomjs-1.9.8-linux-x86_64.tar.bz2
Saving to /usr/share/reepio/node_modules/karma-phantomjs-launcher/node_modules/phantomjs/phantomjs/phantomjs-1.9.8-linux-x86_64.tar.bz2
Receiving...
[=---------------------------------------] 2% 0.0s
Received 12854K total.
Extracting tar contents (via spawned process)
Removing /usr/share/reepio/node_modules/karma-phantomjs-launcher/node_modules/phantomjs/lib/phantom
Copying extracted folder /usr/share/reepio/node_modules/karma-phantomjs-launcher/node_modules/phantomjs/phantomjs/phantomjs-1.9.8-linux-x86_64.tar.bz2-extract-1429987924332/phantomjs-1.9.8-linux-x86_64 -> /usr/share/reepio/node_modules/karma-phantomjs-launcher/node_modules/phantomjs/lib/phantom
Writing location.js file
Done. Phantomjs binary available at /usr/share/reepio/node_modules/karma-phantomjs-launcher/node_modules/phantomjs/lib/phantom/bin/phantomjs
npm ERR! Linux 3.2.0-4-amd64
npm ERR! argv "node" "/usr/local/bin/npm" "install"
npm ERR! node v0.12.2
npm ERR! npm v2.8.4
npm ERR! code EBADF
npm ERR! errno -9

npm ERR! EBADF, fstat
npm ERR!
npm ERR! If you need help, you may report this error at:
npm ERR! https://github.com/npm/npm/issues

npm ERR! Please include the following file with any support request:
npm ERR! /usr/share/reepio/npm-debug.log

stuck at reepio loading
Tim Durward
@TimDurward
Apr 25 2015 18:53
seems like it can't unpack the tar file
one second here
can you try npm cache clean
npm cache clean
bluenevus
@bluenevus
Apr 25 2015 18:54
ok
done
Tim Durward
@TimDurward
Apr 25 2015 18:58
Ok try and sudo apt-get install gifsicle
Seems like gifsicle serves their tar files gzipped and wheezy is not happy about it and can't untar it, since it's still a compressed version (A file is compressed on one end, then sent to the client where it's uncompressed using gzip)
bluenevus
@bluenevus
Apr 25 2015 18:59
ok. after that do you want me to reinstall?
Tim Durward
@TimDurward
Apr 25 2015 18:59
Yep just run the same npm install as before
bluenevus
@bluenevus
Apr 25 2015 19:00
runniing
root@ip-10-29-27-77:/usr/share/reepio# npm install
npm WARN package.json reep.io@1.2.0 No repository field.
npm WARN package.json karma-phantomjs-launcher@0.1.4 No README data
npm WARN unmet dependency /usr/share/reepio/node_modules/imagemin/node_modules/imagemin-gifsicle/node_modules/gifsicle/node_modules/bin-build/node_modules/decompress/node_modules/stream-combiner2 requires through2@'~0.5.1' but will load
npm WARN unmet dependency /usr/share/reepio/node_modules/imagemin/node_modules/through2,
npm WARN unmet dependency which is version 0.6.5
npm WARN unmet dependency /usr/share/reepio/node_modules/imagemin/node_modules/imagemin-gifsicle/node_modules/gifsicle/node_modules/bin-wrapper/node_modules/bin-check/node_modules/executable requires meow@'^3.1.0' but will load
npm WARN unmet dependency /usr/share/reepio/node_modules/imagemin/node_modules/meow,
npm WARN unmet dependency which is version 2.1.0
npm WARN unmet dependency /usr/share/reepio/node_modules/imagemin/node_modules/imagemin-optipng/node_modules/optipng-bin/node_modules/bin-build/node_modules/decompress/node_modules/stream-combiner2 requires through2@'~0.5.1' but will load
npm WARN unmet dependency /usr/share/reepio/node_modules/imagemin/node_modules/through2,
npm WARN unmet dependency which is version 0.6.5
npm WARN unmet dependency /usr/share/reepio/node_modules/imagemin/node_modules/imagemin-optipng/node_modules/optipng-bin/node_modules/bin-wrapper/node_modules/bin-check/node_modules/executable requires meow@'^3.1.0' but will load
npm WARN unmet dependency /usr/share/reepio/node_modules/imagemin/node_modules/meow,
npm WARN unmet dependency which is version 2.1.0
npm WARN unmet dependency /usr/share/reepio/node_modules/imagemin/node_modules/imagemin-pngquant/node_modules/pngquant-bin/node_modules/bin-build/node_modules/decompress/node_modules/stream-combiner2 requires through2@'~0.5.1' but will load
npm WARN unmet dependency /usr/share/reepio/node_modules/imagemin/node_modules/through2,
npm WARN unmet dependency which is version 0.6.5
npm WARN unmet dependency /usr/share/reepio/node_modules/imagemin/node_modules/imagemin-pngquant/node_modules/pngquant-bin/node_modules/bin-wrapper/node_modules/bin-check/node_modules/executable requires meow@'^3.1.0' but will load
npm WARN unmet dependency /usr/share/reepio/node_modules/imagemin/node_modules/meow,
npm WARN unmet dependency which is version 2.1.0
npm WARN unmet dependency /usr/share/reepio/node_modules/imagemin/node_modules/imagemin-pngquant/node_modules/pngquant-bin/node_modules/bin-wrapper/node_modules/download/node_modules/got requires read-all-stream@'^2.0.0' but will load
npm WARN unmet dependency /usr/share/reepio/node_modules/imagemin/node_modules/imagemin-pngquant/node_modules/pngquant-bin/node_modules/bin-wrapper/node_modules/download/node_modules/read-all-stream,
npm WARN unmet dependency which is version 1.0.2
npm WARN unmet dependency /usr/share/reepio/node_modules/imagemin/node_modules/imagemin-pngquant/node_modules/pngquant-bin/node_modules/bin-wrapper/node_modules/download/node_modules/stream-combiner2 requires through2@'~0.5.1' but will load
npm WARN unmet dependency /usr/share/reepio/node_modules/imagemin/node_modules/through2,
npm WARN unmet dependency which is version 0.6.5
protractor@1.8.0 node_modules/protractor
├── jasminewd@1.1.0
├── jasminewd2@0.0.2
├── saucelabs@0.1.1
├── html-entities@1.1.2
├── q@1.0.0
├── minijasminenode@1.1.1
├── adm-zip@0.4.4
├── optimist@0.6.1 (wordwrap@0.0.2, minimist@0.0.10)
├── glob@3.2.11 (inherits@2.0.1, minimatch@0.3.0)
├── accessibility-developer-tools@2.6.0
├── source-map-support@0.2.10 (source-map@0.1.32)
├── request@2.36.0 (json-stringify-safe@5.0.0, aws-sign2@0.5.0, forever-agent@0.5.2, tunnel-agent@0.4.0, qs@0.6.6, oauth-sign@0.3.0, mime@1.2.11, node-uuid@1.4.3, form-data@0.1.4, http-signature@0.10.1, tough-cookie@0.13.0, hawk@1.0.0)
├── lodash@2.4.1
├── jasmine@2.1.1 (jasmine-core@2.1.3)
└── selenium-webdriver@2.44.0 (tmp@0.0.24, xml2js@0.4.4)
here is the output...still hung at reepio loading
here are the logs when the server is running

root@ip-10-29-27-77:/usr/share/reepio# npm start

reep.io@1.2.0 start /usr/share/reepio
http-server -a localhost -p 8000 -c-1

Starting up http-server, serving ./public on port: 8000
Hit CTRL-C to stop the server
[Sat, 25 Apr 2015 19:00:16 GMT] "GET /" "Mozilla/5.0 (Windows NT 6.3; WOW64) AppleWebKit/537.36 (KHTML, like Gecko) Chrome/42.0.2311.90 Safari/537.36"
[Sat, 25 Apr 2015 19:00:17 GMT] "GET /assets/fonts/fontello/css/fontello.css" "Mozilla/5.0 (Windows NT 6.3; WOW64) AppleWebKit/537.36 (KHTML, like Gecko) Chrome/42.0.2311.90 Safari/537.36"
[Sat, 25 Apr 2015 19:00:17 GMT] "GET /assets/js/socialshareprivacy/socialshareprivacy.css" "Mozilla/5.0 (Windows NT 6.3; WOW64) AppleWebKit/537.36 (KHTML, like Gecko) Chrome/42.0.2311.90 Safari/537.36"
[Sat, 25 Apr 2015 19:00:17 GMT] "GET /assets/bower_components/jquery/dist/jquery.js" "Mozilla/5.0 (Windows NT 6.3; WOW64) AppleWebKit/537.36 (KHTML, like Gecko) Chrome/42.0.2311.90 Safari/537.36"
[Sat, 25 Apr 2015 19:00:17 GMT] "GET /assets/bower_components/angular-animate/angular-animate.js" "Mozilla/5.0 (Windows NT 6.3; WOW64) AppleWebKit/537.36 (KHTML, like Gecko) Chrome/42.0.2311.90 Safari/537.36"
[Sat, 25 Apr 2015 19:00:17 GMT] "GET /assets/bower_components/angular/angular.js" "Mozilla/5.0 (Windows NT 6.3; WOW64) AppleWebKit/537.36 (KHTML, like Gecko) Chrome/42.0.2311.90 Safari/537.36"
[Sat, 25 Apr 2015 19:00:17 GMT] "GET /assets/bower_components/angular-route/angular-route.js" "Mozilla/5.0 (Windows NT 6.3; WOW64) AppleWebKit/537.36 (KHTML, like Gecko) Chrome/42.0.2311.90 Safari/537.36"
[Sat, 25 Apr 2015 19:00:17 GMT] "GET /assets/bower_components/angulartics/src/angulartics.js" "Mozilla/5.0 (Windows NT 6.3; WOW64) AppleWebKit/537.36 (KHTML, like Gecko) Chrome/42.0.2311.90 Safari/537.36"
[Sat, 25 Apr 2015 19:00:17 GMT] "GET /assets/bower_components/angulartics/src/angulartics-piwik.js" "Mozilla/5.0 (Windows NT 6.3; WOW64) AppleWebKit/537.36 (KHTML, like Gecko) Chrome/42.0.2311.90 Safari/537.36"
[Sat, 25 Apr 2015 19:00:17 GMT] "GET /assets/bower_components/reepio-paste-to-clipboard/bin/js/swfobject.js" "Mozilla/5.0 (Windows NT 6.3; WOW64) AppleWebKit/537.36 (KHTML, like Gecko) Chrome/42.0.2311.90 Safari/537.36"
[Sat, 25 Apr 2015 19:00:17 GMT] "GET /assets/bower_components/threejs/build/three.js" "Mozilla/5.0 (Windows NT 6.3; WOW64) AppleWebKit/537.36 (KHTML, like Gecko) Chrome/42.0.2311.90 Safari/537.36"
[Sat, 25 Apr 2015 19:00:17 GMT] "GET /assets/js/ui-bootstrap-0.11.0.js" "Mozilla/5.0 (Windows NT 6.3; WOW64) AppleWebKit/537.36 (KHTML, like Gecko) Chrome/42.0.2311.90 Safari/537.36"
[Sat, 25 Apr 2015 19:00:17 GMT] "GET /assets/bower_components/bootstrap/dist/js/bootstrap.js" "Mozilla/5.0 (Windows NT 6.3; WOW64) AppleWebKit/537.36 (KHTML, like Gecko) Chrome/42.0.2311.90 Safari/537.36"
[Sat, 25 Apr 2015 19:00:17 GMT] "GET /assets/js/jquery.socialshareprivacy.js" "Mozilla/5.0 (Windows NT 6.3; WOW64) AppleWebKit/537.36 (KHTML, like Gecko) Chrome/42.0.2311.90 Safari/537.36"
[Sat, 25 Apr 2015 19:00:17 GMT] "GET /assets/js/paste.js/paste.js"; "Mozilla/5.0 (Windows NT 6.3; WOW64) AppleWebKit/537.36 (KHTML, like Gecko) Chrome/42.0.2311.90 Safari/537.36"
[Sat, 25 Apr 2015 19:00:17 GMT] "GET /assets/css/theme.css" "Mozilla/5.0 (Windows NT 6.3; WOW64) AppleWebKit/537.36 (KHTML, like Gecko) Chrome/42.0.2311.90 Safari/537.36"
[Sat, 25 Apr 2015 19:00:17 GMT] "GET /assets/js/peer.js" "Mozilla/5.0 (Windows NT 6.3; WOW64) AppleWebKit/537.36 (KHTML, like Gecko) Chrome/42.0.2311.90 Safari/537.36"
[Sat, 25 Apr 2015 19:00:17 GMT] "GET /modules/common/filters/stringFilters.js" "Mozilla/5.0 (Windows NT 6.3; WOW64) AppleWebKit/537.36 (KHTML, like Gecko) Chrome/42.0.2311.90 Safari/537.36"
[Sat, 25 Apr 2015 19:00:17 GMT] "GET /modules/common/filters/fileFilters.js" "Mozilla/5.0 (Windows NT 6.3; WOW64) AppleWebKit/537.36 (KHTML, like Gecko) Chrome/42.0.2311.90 Safari/537.36"
[Sat, 25 Apr 2015 19:00:17 GMT] "GET /modules/common/directives/fileIcon.js" "Mozilla/5.0 (Windows NT 6.3; WOW64) AppleWebKit/537.36 (KHTML, like Gecko) Chrome/42.0.2311.90 Safari/537.36"
[Sat, 25 Apr 2015 19:00:17 GMT] "GET /mo

npm test error...probably more useful
INFO [karma]: Karma v0.10.10 server started at http://localhost:9876/
INFO [launcher]: Starting browser PhantomJS
WARN [watcher]: Pattern "/usr/share/reepio/public/assets/js/jquery-1.11.1.js" does not match any file.
WARN [watcher]: Pattern "/usr/share/reepio/public/assets/js/angular-1.2.21/angular.js" does not match any file.
WARN [watcher]: Pattern "/usr/share/reepio/public/assets/js/angular-1.2.21/angular-route.js" does not match any file.
WARN [watcher]: Pattern "/usr/share/reepio/public/assets/js/angular-1.2.21/angular-animate.js" does not match any file.
WARN [watcher]: Pattern "/usr/share/reepio/public/assets/js/angular-1.2.21/angular-mocks.js" does not match any file.
WARN [watcher]: Pattern "/usr/share/reepio/public/assets/js/angulartics-0.16.1/src/angulartics.js" does not match any file.
WARN [watcher]: Pattern "/usr/share/reepio/public/assets/js/angulartics-0.16.1/src/angulartics-piwik.js" does not match any file.
WARN [watcher]: Pattern "/usr/share/reepio/public/config.js" does not match any file.
INFO [PhantomJS 1.9.8 (Linux)]: Connected on socket kIcP2HIa5gLam0Fo9dIU
PhantomJS 1.9.8 (Linux) ERROR
ReferenceError: Can't find variable: jQuery
at /usr/share/reepio/public/assets/js/jquery.socialshareprivacy.js:443
PhantomJS 1.9.8 (Linux): Executed 0 of 0 ERROR (0.285 secs / 0 secs)
Tim Durward
@TimDurward
Apr 25 2015 19:05
hmm one second here
Tim Durward
@TimDurward
Apr 25 2015 19:17
Weird, seems like it can't find the files, have you run grunt yet?
bluenevus
@bluenevus
Apr 25 2015 19:18
it says command cat be found
Tim Durward
@TimDurward
Apr 25 2015 19:18
grunt willl controll the bower-components
bluenevus
@bluenevus
Apr 25 2015 19:18
npm install grunt does nothin
what is the command to install grunt?
Tim Durward
@TimDurward
Apr 25 2015 19:18
I believe it is npm install -g grunt-cli but it's been a while ;)
let me know if thats not it
bluenevus
@bluenevus
Apr 25 2015 19:19
looks like thats it
this is the error when I run grunt

Loading "imagemin.js" tasks...ERROR

Error: Cannot find module 'imagemin-gifsicle'
Warning: Task "imagemin" not found. Use --force to continue.

Tim Durward
@TimDurward
Apr 25 2015 19:20
you finished downloading it?
bluenevus
@bluenevus
Apr 25 2015 19:20
so i did an npm isntall imagemin-gifsicle
Tim Durward
@TimDurward
Apr 25 2015 19:20
and when you run it thats the error?
bluenevus
@bluenevus
Apr 25 2015 19:20
yes so I did an npm install imagemin-gifsicile and waiting for it to finish theinstall
looks like its installing, pre-build test passed
grunt installed
this is the new error on npm test

root@ip-10-29-27-77:/usr/share/reepio# npm test

reep.io@1.2.0 test /usr/share/reepio
karma start karma.conf.js

INFO [karma]: Karma v0.10.10 server started at http://localhost:9876/
INFO [launcher]: Starting browser PhantomJS
WARN [watcher]: Pattern "/usr/share/reepio/public/assets/js/jquery-1.11.1.js" does not match any file.
WARN [watcher]: Pattern "/usr/share/reepio/public/assets/js/angular-1.2.21/angular.js" does not match any file.
WARN [watcher]: Pattern "/usr/share/reepio/public/assets/js/angular-1.2.21/angular-route.js" does not match any file.
WARN [watcher]: Pattern "/usr/share/reepio/public/assets/js/angular-1.2.21/angular-animate.js" does not match any file.
WARN [watcher]: Pattern "/usr/share/reepio/public/assets/js/angular-1.2.21/angular-mocks.js" does not match any file.
WARN [watcher]: Pattern "/usr/share/reepio/public/assets/js/angulartics-0.16.1/src/angulartics.js" does not match any file.
WARN [watcher]: Pattern "/usr/share/reepio/public/assets/js/angulartics-0.16.1/src/angulartics-piwik.js" does not match any file.
WARN [watcher]: Pattern "/usr/share/reepio/public/config.js" does not match any file.
INFO [PhantomJS 1.9.8 (Linux)]: Connected on socket Zec7evv3vVUNviHCCKyu
PhantomJS 1.9.8 (Linux) ERROR
ReferenceError: Can't find variable: jQuery
at /usr/share/reepio/public/assets/js/jquery.socialshareprivacy.js:443
PhantomJS 1.9.8 (Linux) ERROR
ReferenceError: Can't find variable: angular
at /usr/share/reepio/public/assets/js/ui-bootstrap-0.11.0.js:8
PhantomJS 1.9.8 (Linux) ERROR
ReferenceError: Can't find variable: angular
at /usr/share/reepio/public/modules/clipboard/module.js:5
PhantomJS 1.9.8 (Linux) ERROR
ReferenceError: Can't find variable: angular
at /usr/share/reepio/public/modules/common/module.js:25
PhantomJS 1.9.8 (Linux) ERROR
ReferenceError: Can't find variable: angular
at /usr/share/reepio/public/modules/download/module.js:25
PhantomJS 1.9.8 (Linux) ERROR
ReferenceError: Can't find variable: angular
at /usr/share/reepio/public/modules/static/module.js:25
PhantomJS 1.9.8 (Linux) ERROR
ReferenceError: Can't find variable: angular
at /usr/share/reepio/public/modules/upload/module.js:25
PhantomJS 1.9.8 (Linux) ERROR
ReferenceError: Can't find variable: angular
at /usr/share/reepio/public/modules/clipboard/clipboardDirective.js:5
PhantomJS 1.9.8 (Linux) ERROR
ReferenceError: Can't find variable: angular
at /usr/share/reepio/public/modules/common/converterService.js:8
PhantomJS 1.9.8 (Linux) ERROR
ReferenceError: Can't find variable: angular
at /usr/share/reepio/public/modules/common/crypto.js:25
PhantomJS 1.9.8 (Linux) ERROR
ReferenceError: Can't find variable: angular
at /usr/share/reepio/public/modules/common/detectCrawlerService.js:23
PhantomJS 1.9.8 (Linux): Executed 0 of 0 ERROR (0.352 secs / 0 secs)

jquery and angular
Tim Durward
@TimDurward
Apr 25 2015 19:26
ok well we are getting closer! one sec
bluenevus
@bluenevus
Apr 25 2015 19:27
well, if this works out, I have a much bigger job for you. same sort of thing...many dependencies on an abandoned project I want to run. just send me your email and I'll give you the details.
Tim Durward
@TimDurward
Apr 25 2015 19:30
Sounds fun!
have you tried running grunt afterwards
whats the output
bluenevus
@bluenevus
Apr 25 2015 19:32

root@ip-10-29-27-77:/usr/share/reepio# grunt
Running "ngAnnotate:angular" (ngAnnotate) task

1 file successfully generated.

Running "ngAnnotate:thirdparty" (ngAnnotate) task

1 file successfully generated.

Running "ngAnnotate:scripts" (ngAnnotate) task

1 file successfully generated.

Running "ngAnnotate:app" (ngAnnotate) task

1 file successfully generated.

Running "uglify:libs" (uglify) task

Running "uglify:app" (uglify) task

Running "cssmin:theme" (cssmin) task
File dist/assets/css/theme.min.css created: 189.96 kB → 152.09 kB

Running "copy:main" (copy) task
Created 13 directories, copied 97 files

Running "imagemin:dynamic" (imagemin) task
root@ip-10-29-27-77:/usr/share/reepio#

Tim Durward
@TimDurward
Apr 25 2015 19:32
thats a good sign
try npm run test
bluenevus
@bluenevus
Apr 25 2015 19:34

root@ip-10-29-27-77:/usr/share/reepio# npm run test

reep.io@1.2.0 test /usr/share/reepio
karma start karma.conf.js

INFO [karma]: Karma v0.10.10 server started at http://localhost:9876/
INFO [launcher]: Starting browser PhantomJS
WARN [watcher]: Pattern "/usr/share/reepio/public/assets/js/jquery-1.11.1.js" does not match any file.
WARN [watcher]: Pattern "/usr/share/reepio/public/assets/js/angular-1.2.21/angular.js" does not match any file.
WARN [watcher]: Pattern "/usr/share/reepio/public/assets/js/angular-1.2.21/angular-route.js" does not match any file.
WARN [watcher]: Pattern "/usr/share/reepio/public/assets/js/angular-1.2.21/angular-animate.js" does not match any file.
WARN [watcher]: Pattern "/usr/share/reepio/public/assets/js/angular-1.2.21/angular-mocks.js" does not match any file.
WARN [watcher]: Pattern "/usr/share/reepio/public/assets/js/angulartics-0.16.1/src/angulartics.js" does not match any file.
WARN [watcher]: Pattern "/usr/share/reepio/public/assets/js/angulartics-0.16.1/src/angulartics-piwik.js" does not match any file.
WARN [watcher]: Pattern "/usr/share/reepio/public/config.js" does not match any file.
INFO [PhantomJS 1.9.8 (Linux)]: Connected on socket Ouxaj_cP57sGaeycEjyL
PhantomJS 1.9.8 (Linux) ERROR
ReferenceError: Can't find variable: jQuery
at /usr/share/reepio/public/assets/js/jquery.socialshareprivacy.js:443
PhantomJS 1.9.8 (Linux) ERROR
ReferenceError: Can't find variable: angular
at /usr/share/reepio/public/assets/js/ui-bootstrap-0.11.0.js:8
PhantomJS 1.9.8 (Linux) ERROR
ReferenceError: Can't find variable: angular
at /usr/share/reepio/public/modules/clipboard/module.js:5
PhantomJS 1.9.8 (Linux) ERROR
ReferenceError: Can't find variable: angular
at /usr/share/reepio/public/modules/common/module.js:25
PhantomJS 1.9.8 (Linux) ERROR
ReferenceError: Can't find variable: angular
at /usr/share/reepio/public/modules/download/module.js:25
PhantomJS 1.9.8 (Linux) ERROR
ReferenceError: Can't find variable: angular
at /usr/share/reepio/public/modules/static/module.js:25
PhantomJS 1.9.8 (Linux) ERROR
ReferenceError: Can't find variable: angular
at /usr/share/reepio/public/modules/upload/module.js:25
PhantomJS 1.9.8 (Linux) ERROR
ReferenceError: Can't find variable: angular
at /usr/share/reepio/public/modules/clipboard/clipboardDirective.js:5
PhantomJS 1.9.8 (Linux): Executed 0 of 0 ERROR (0.368 secs / 0 secs)

Tim Durward
@TimDurward
Apr 25 2015 19:34
what happens when you run npm start
bluenevus
@bluenevus
Apr 25 2015 19:36

http-server -a localhost -p 8000 -c-1

Starting up http-server, serving ./public on port: 8000
Hit CTRL-C to stop the server

however, it just hangs on the website saying reepio loading
doesn't go past that
same image I sent through fiverr
Tim Durward
@TimDurward
Apr 25 2015 19:36
check out the console
seems like some assets doesn't get compiled
bluenevus
@bluenevus
Apr 25 2015 19:37
here is the output in the console
Hit CTRL-C to stop the server
[Sat, 25 Apr 2015 19:36:43 GMT] "GET /" "Mozilla/5.0 (Windows NT 6.3; WOW64) AppleWebKit/537.36 (KHTML, like Gecko) Chrome/42.0.2311.90 Safari/537.36"
[Sat, 25 Apr 2015 19:36:43 GMT] "GET /assets/fonts/fontello/css/fontello.css" "Mozilla/5.0 (Windows NT 6.3; WOW64) AppleWebKit/537.36 (KHTML, like Gecko) Chrome/42.0.2311.90 Safari/537.36"
[Sat, 25 Apr 2015 19:36:43 GMT] "GET /assets/js/socialshareprivacy/socialshareprivacy.css" "Mozilla/5.0 (Windows NT 6.3; WOW64) AppleWebKit/537.36 (KHTML, like Gecko) Chrome/42.0.2311.90 Safari/537.36"
[Sat, 25 Apr 2015 19:36:43 GMT] "GET /assets/bower_components/jquery/dist/jquery.js" "Mozilla/5.0 (Windows NT 6.3; WOW64) AppleWebKit/537.36 (KHTML, like Gecko) Chrome/42.0.2311.90 Safari/537.36"
[Sat, 25 Apr 2015 19:36:43 GMT] "GET /assets/bower_components/angular/angular.js" "Mozilla/5.0 (Windows NT 6.3; WOW64) AppleWebKit/537.36 (KHTML, like Gecko) Chrome/42.0.2311.90 Safari/537.36"
[Sat, 25 Apr 2015 19:36:43 GMT] "GET /assets/bower_components/angular-route/angular-route.js" "Mozilla/5.0 (Windows NT 6.3; WOW64) AppleWebKit/537.36 (KHTML, like Gecko) Chrome/42.0.2311.90 Safari/537.36"
[Sat, 25 Apr 2015 19:36:43 GMT] "GET /assets/bower_components/angular-animate/angular-animate.js" "Mozilla/5.0 (Windows NT 6.3; WOW64) AppleWebKit/537.36 (KHTML, like Gecko) Chrome/42.0.2311.90 Safari/537.36"
[Sat, 25 Apr 2015 19:36:43 GMT] "GET /assets/bower_components/angulartics/src/angulartics.js" "Mozilla/5.0 (Windows NT 6.3; WOW64) AppleWebKit/537.36 (KHTML, like Gecko) Chrome/42.0.2311.90 Safari/537.36"
[Sat, 25 Apr 2015 19:36:43 GMT] "GET /assets/bower_components/angulartics/src/angulartics-piwik.js" "Mozilla/5.0 (Windows NT 6.3; WOW64) AppleWebKit/537.36 (KHTML, like Gecko) Chrome/42.0.2311.90 Safari/537.36"
[Sat, 25 Apr 2015 19:36:43 GMT] "GET /assets/bower_components/reepio-paste-to-clipboard/bin/js/swfobject.js" "Mozilla/5.0 (Windows NT 6.3; WOW64) AppleWebKit/537.36 (KHTML, like Gecko) Chrome/42.0.2311.90 Safari/537.36"
[Sat, 25 Apr 2015 19:36:44 GMT] "GET /assets/bower_components/threejs/build/three.js" "Mozilla/5.0 (Windows NT 6.3; WOW64) AppleWebKit/537.36 (KHTML, like Gecko) Chrome/42.0.2311.90 Safari/537.36"
[Sat, 25 Apr 2015 19:36:44 GMT] "GET /assets/bower_components/bootstrap/dist/js/bootstrap.js" "Mozilla/5.0 (Windows NT 6.3; WOW64) AppleWebKit/537.36 (KHTML, like Gecko) Chrome/42.0.2311.90 Safari/537.36"
[Sat, 25 Apr 2015 19:36:44 GMT] "GET /assets/js/jquery.socialshareprivacy.js" "Mozilla/5.0 (Windows NT 6.3; WOW64) AppleWebKit/537.36 (KHTML, like Gecko) Chrome/42.0.2311.90 Safari/537.36"
[Sat, 25 Apr 2015 19:36:44 GMT] "GET /assets/js/ui-bootstrap-0.11.0.js" "Mozilla/5.0 (Windows NT 6.3; WOW64) AppleWebKit/537.36 (KHTML, like Gecko) Chrome/42.0.2311.90 Safari/537.36"
[Sat, 25 Apr 2015 19:36:44 GMT] "GET /assets/js/paste.js/paste.js"; "Mozilla/5.0 (Windows NT 6.3; WOW64) AppleWebKit/537.36 (KHTML, like Gecko) Chrome/42.0.2311.90 Safari/537.36"
[Sat, 25 Apr 2015 19:36:44 GMT] "GET /assets/js/peer.js" "Mozilla/5.0 (Windows NT 6.3; WOW64) AppleWebKit/537.36 (KHTML, like Gecko) Chrome/42.0.2311.90 Safari/537.36"
[Sat, 25 Apr 2015 19:36:44 GMT] "GET /assets/css/theme.css" "Mozilla/5.0 (Windows NT 6.3; WOW64) AppleWebKit/537.36 (KHTML, like Gecko) Chrome/42.0.2311.90 Safari/537.36"
[Sat, 25 Apr 2015 19:36:44 GMT] "GET /modules/common/filters/fileFilters.js" "Mozilla/5.0 (Windows NT 6.3; WOW64) AppleWebKit/537.36 (KHTML, like Gecko) Chrome/42.0.2311.90 Safari/537.36"
[Sat, 25 Apr 2015 19:36:44 GMT] "GET /modules/common/directives/progressBar.js" "Mozilla/5.0 (Windows NT 6.3; WOW64) AppleWebKit/537.36 (KHTML, like Gecko) Chrome/42.0.2311.90 Safari/537.36"
[Sat, 25 Apr 2015 19:36:44 GMT] "GET /modules/common/filters/stringFilters.js" "Mozilla/5.0 (Windows NT 6.3; WOW64) AppleWebKit/537.36 (KHTML, like Gecko) Chrome/42.0.2311.90 Safari/537.36"
[Sat, 25 Apr 2015 19:36:44 GMT] "GET /modules/common/directives/fileIcon.js" "Mozilla/5.0 (Windows NT 6.3; WOW64) AppleWebKit/537.36 (KHTML, like Gecko) Chrome/42.0.2311.90 Safari/537.36"
[Sat, 25 Apr 2015 19:36:44 GMT] "GET
that is what it looks like when I go to the website and it hangs. refreshing results in the same message
Tim Durward
@TimDurward
Apr 25 2015 19:38
oh but what does the browser console show
bluenevus
@bluenevus
Apr 25 2015 19:38
reep.io is loading
thats it
are you talking about the window/
you can see it right here
Tim Durward
@TimDurward
Apr 25 2015 19:41
im talkin about the javascript console
like chromes console cntrl + shift + J
bluenevus
@bluenevus
Apr 25 2015 19:43
Uncaught ReferenceError: jQuery is not defined
fileFilters.js:25 Uncaught ReferenceError: angular is not defined
stringFilters.js:25 Uncaught ReferenceError: angular is not defined
fileIcon.js:61 Uncaught ReferenceError: angular is not defined
progressBar.js:25 Uncaught ReferenceError: angular is not defined
reepIoLogo.js:24 Uncaught ReferenceError: angular is not defined
module.js:25 Uncaught ReferenceError: angular is not defined
crypto.js:25 Uncaught ReferenceError: angular is not defined
notifications.js:25 Uncaught ReferenceError: angular is not defined
randomService.js:23 Uncaught ReferenceError: angular is not defined
detectCrawlerService.js:23 Uncaught ReferenceError: angular is not defined
dialog.js:25 Uncaught ReferenceError: angular is not defined
loading.js:25 Uncaught ReferenceError: angular is not defined
converterService.js:8 Uncaught ReferenceError: angular is not defined
module.js:5 Uncaught ReferenceError: angular is not defined
clipboardDirective.js:5 Uncaught ReferenceError: angular is not defined
peeringService.js:23 Uncaught ReferenceError: angular is not defined
module.js:25 Uncaught ReferenceError: angular is not defined
downloadController.js:25 Uncaught ReferenceError: angular is not defined
downloadService.js:23 Uncaught ReferenceError: angular is not defined
loadingIndicatorDirective.js:25 Uncaught ReferenceError: angular is not defined
storageService.js:25 Uncaught ReferenceError: angular is not defined
module.js:25 Uncaught ReferenceError: angular is not defined
uploadController.js:25 Uncaught ReferenceError: angular is not defined
uploadService.js:23 Uncaught ReferenceError: angular is not defined
dropZoneDirective.js:25 Uncaught ReferenceError: angular is not defined
module.js:25 Uncaught ReferenceError: angular is not defined
static.js:25 Uncaught ReferenceError: angular is not defined
slidingFileDirective.js:25 Uncaught ReferenceError: angular is not defined
title.js:25 Uncaught ReferenceError: angular is not defined
https://share.microhealthllc.com/config.js Failed to load resource: the server responded with a status of 404 (Not Found)
app.js:39 Uncaught ReferenceError: angular is not defined
share.microhealthllc.com/:7 Mixed Content: The page at 'https://share.microhealthllc.com/' was loaded over HTTPS, but requested an insecure stylesheet 'http://fonts.googleapis.com/css?family=Open+Sans:400,300,700'. This request has been blocked; the content must be served over HTTPS.
https://share.microhealthllc.com/assets/bower_components/jquery/dist/jquery.js Failed to load resource: the server responded with a status of 404 (Not Found)
https://share.microhealthllc.com/assets/bower_components/angular/angular.js Failed to load resource: the server responded with a status of 404 (Not Found)
https://share.microhealthllc.com/assets/bower_components/angular-route/angular-route.js Failed to load resource: the server responded with a status of 404 (Not Found)
https://share.microhealthllc.com/assets/bower_components/angular-animate/angular-animate.js Failed to load resource: the server responded with a status of 404 (Not Found)
https://share.microhealthllc.com/assets/bower_components/angulartics/src/angulartics.js Failed to load resource: the server responded with a status of 404 (Not Found)
https://share.microhealthllc.com/assets/bower_components/angulartics/src/angulartics-piwik.js Failed to load resource: the server responded with a status of 404 (Not Found)
https://share.microhealthllc.com/assets/bower_components/reepio-paste-to-clipboard/bin/js/swfobject.js Failed to load resource: the server responded with a status of 404 (Not Found)
https://share.microhealthllc.com/assets/bower_components/threejs/build/three.js Failed to load resource: the server responded with a status of 404 (Not Found)
https://share.microhealthllc.com/assets/bower_components/bootstrap/dist/js/bootstrap.js Failed to load resource: the server responded with a status of 404 (Not Found)
ui-bootstrap-0.11.0.js:8 Uncaught ReferenceError: angular is not defined
jquery.socialshareprivacy.js:443 Uncaught ReferenceError: jQuery is not defined
paste.js:5 Uncaught ReferenceError: jQuery is not defined
fileFilters.js:25 Uncaught ReferenceError: angular is not defined
stringFilters.js:25 Uncaught ReferenceError: angular is not defined
fileIcon.js:61 Uncaught ReferenceError: angular is not defined
progressBar.js:25 Uncaught ReferenceError: angular is not defined
reepIoLogo.js:24 Uncaught ReferenceError: angular is not defined
module.js:25 Uncaught ReferenceError: angular is not defined
crypto.js:25 Uncaught ReferenceError: angular is not defined
notifications.js:25 Uncaught ReferenceError: angular is not defined
randomService.js:23 Uncaught ReferenceError: angular is not defined
detectCrawlerService.js:23 Uncaught ReferenceError: angular is not defined
dialog.js:25 Uncaught ReferenceError: angular is not defined
loading.js:25 Uncaught ReferenceError: angular is not defined
converterService.js:8 Uncaught ReferenceError: angular is not defined
module.js:5 Uncaught ReferenceError: angular is not defined
clipboardDirective.js:5 Uncaught ReferenceError: angular is not defined
peeringService.js:23 Uncaught ReferenceError: angular is not defined
module.js:25 Uncaught ReferenceError: angular is not defined
downloadController.js:25 Uncaught ReferenceError: angular is not defined
downloadService.js:23 Uncaught ReferenceError: angular is not defined
loadingIndicatorDirective.js:25 Uncaught ReferenceError: angular is not defined
storageService.js:25 Uncaught ReferenceError: angular is not defined
module.js:25 Uncaught ReferenceError: angular is not defined
uploadController.js:25 Uncaught ReferenceError: angular is not defined
uploadService.js:23 Uncaught ReferenceError: angular is not defined
dropZoneDirective.js:25 Uncaught ReferenceError: angular is not defined
module.js:25 Uncaught ReferenceError: angular is not defined
static.js:25 Uncaught ReferenceError: angular is not defined
slidingFileDirective.js:25 Uncaught ReferenceError: angular is not defined
title.js:25 Uncaught ReferenceError: angular is not defined
https://share.microhealthllc.com/config.js Failed to load resource: the server responded with a status of 404 (Not Found)
app.js:39 Uncaught ReferenceError: angular
Tim Durward
@TimDurward
Apr 25 2015 19:45
Do you run the debian on a seperate computer or in a VM ?
bluenevus
@bluenevus
Apr 25 2015 19:47
its on a vm running debian
I ran it on lmde also and had the same issues
debian distro on debian
debian distro on linux mint
that was running in virtual box
I tried on plain ole debian too. that running in virutal box
Tim Durward
@TimDurward
Apr 25 2015 19:48
Oh that should be fine then. Could you check your reepio directory check if it even has the public folder
bluenevus
@bluenevus
Apr 25 2015 19:48
yes, it des
app.js config.dist.js index.html modules sitemap.xml
assets github-btn.html index_prod.html robots.txt
Tim Durward
@TimDurward
Apr 25 2015 19:48
it has the assets?
bluenevus
@bluenevus
Apr 25 2015 19:48
yes
css fonts images js
Tim Durward
@TimDurward
Apr 25 2015 19:49
and does it have bower_components ?
bluenevus
@bluenevus
Apr 25 2015 19:49
how do I check that?
Tim Durward
@TimDurward
Apr 25 2015 19:49
under assets folder
bluenevus
@bluenevus
Apr 25 2015 19:50
no
Tim Durward
@TimDurward
Apr 25 2015 19:50
there will be css, fonts, images, js, & bower_components
bluenevus
@bluenevus
Apr 25 2015 19:50
it does not exist
Tim Durward
@TimDurward
Apr 25 2015 19:50
well that would be the issue! :P
ok one sec
there's an issue with grunts task. Let me brainstorm here
bluenevus
@bluenevus
Apr 25 2015 19:51
ok
Tim Durward
@TimDurward
Apr 25 2015 19:51
try npm install again and then grunt
wait!!!!
npm install -g bower
Need to install the bower components. This should fix it
bluenevus
@bluenevus
Apr 25 2015 19:55
ok running the bower
Tim Durward
@TimDurward
Apr 25 2015 19:55
you finished installing it?
bluenevus
@bluenevus
Apr 25 2015 19:56
no...looks like its installing bower_components
still running
Tim Durward
@TimDurward
Apr 25 2015 19:56
Fantastic
bluenevus
@bluenevus
Apr 25 2015 19:56
ok installed, you want me to npm install again?
Tim Durward
@TimDurward
Apr 25 2015 19:56
This will enable the bower files located in assets
one second
bluenevus
@bluenevus
Apr 25 2015 19:57
ok
Tim Durward
@TimDurward
Apr 25 2015 19:57
run bower install
and then run grunt
bluenevus
@bluenevus
Apr 25 2015 19:58
ok done
Tim Durward
@TimDurward
Apr 25 2015 19:58
you ran grunt ?
bluenevus
@bluenevus
Apr 25 2015 19:58
bower install is still running
Tim Durward
@TimDurward
Apr 25 2015 19:58
ok :) let me know when you got everything finished
bluenevus
@bluenevus
Apr 25 2015 19:59
just ran grunt
one moment

Running "ngAnnotate:angular" (ngAnnotate) task

1 file successfully generated.

Running "ngAnnotate:thirdparty" (ngAnnotate) task

1 file successfully generated.

Running "ngAnnotate:scripts" (ngAnnotate) task

1 file successfully generated.

Running "ngAnnotate:app" (ngAnnotate) task

1 file successfully generated.

Running "uglify:libs" (uglify) task

Running "uglify:libs" (uglify) task

Running "uglify:app" (uglify) task

Running "cssmin:theme" (cssmin) task
File dist/assets/css/theme.min.css created: 189.96 kB → 152.09 kB

Running "copy:main" (copy) task
Created 13 directories, copied 99 files

Running "imagemin:dynamic" (imagemin) task

done
Tim Durward
@TimDurward
Apr 25 2015 20:01
alright now start er' up! npm start
bluenevus
@bluenevus
Apr 25 2015 20:02
new javascript console message
Mixed Content: The page at 'https://share.microhealthllc.com/' was loaded over HTTPS, but requested an insecure stylesheet 'http://fonts.googleapis.com/css?family=Open+Sans:400,300,700'. This request has been blocked; the content must be served over HTTPS.
https://share.microhealthllc.com/config.js Failed to load resource: the server responded with a status of 404 (Not Found)
angular.js:3905 Uncaught Error: [$injector:modulerr] Failed to instantiate module peertome due to:
Error: [$injector:modulerr] Failed to instantiate module config due to:
Error: [$injector:nomod] Module 'config' is not available! You either misspelled the module name or forgot to load it. If registering a module ensure that you specify the dependencies as the second argument.
http://errors.angularjs.org/1.2.28/$injector/nomod?p0=config
at https://share.microhealthllc.com/assets/bower_components/angular/angular.js:78:12
at https://share.microhealthllc.com/assets/bower_components/angular/angular.js:1677:17
at ensure (https://share.microhealthllc.com/assets/bower_components/angular/angular.js:1601:38)
at module (https://share.microhealthllc.com/assets/bower_components/angular/angular.js:1675:14)
at https://share.microhealthllc.com/assets/bower_components/angular/angular.js:3877:22
at forEach (https://share.microhealthllc.com/assets/bower_components/angular/angular.js:325:18)
at loadModules (https://share.microhealthllc.com/assets/bower_components/angular/angular.js:3871:5)
at https://share.microhealthllc.com/assets/bower_components/angular/angular.js:3878:40
at forEach (https://share.microhealthllc.com/assets/bower_components/angular/angular.js:325:18)
at loadModules (https://share.microhealthllc.com/assets/bower_components/angular/angular.js:3871:5)
http://errors.angularjs.org/1.2.28/$injector/modulerr?p0=config&p1=Error%3A…ealthllc.com%2Fassets%2Fbower_components%2Fangular%2Fangular.js%3A3871%3A5)
at https://share.microhealthllc.com/assets/bower_components/angular/angular.js:78:12
at https://share.microhealthllc.com/assets/bower_components/angular/angular.js:3905:15
at forEach (https://share.microhealthllc.com/assets/bower_components/angular/angular.js:325:18)
at loadModules (https://share.microhealthllc.com/assets/bower_components/angular/angular.js:3871:5)
at https://share.microhealthllc.com/assets/bower_components/angular/angular.js:3878:40
at forEach (https://share.microhealthllc.com/assets/bower_components/angular/angular.js:325:18)
at loadModules (https://share.microhealthllc.com/assets/bower_components/angular/angular.js:3871:5)
at createInjector (https://share.microhealthllc.com/assets/bower_components/angular/angular.js:3811:11)
at doBootstrap (https://share.microhealthllc.com/assets/bower_components/angular/angular.js:1444:20)
at bootstrap (https://share.microhealthllc.com/assets/bower_components/angular/angular.js:1459:12)
http://errors.angularjs.org/1.2.28/$injector/modulerr?p0=peertome&p1=Error%…althllc.com%2Fassets%2Fbower_components%2Fangular%2Fangular.js%3A1459%3A12
and here is npm test
INFO [karma]: Karma v0.10.10 server started at http://localhost:9876/
INFO [launcher]: Starting browser PhantomJS
WARN [watcher]: Pattern "/usr/share/reepio/public/assets/js/jquery-1.11.1.js" does not match any file.
WARN [watcher]: Pattern "/usr/share/reepio/public/assets/js/angular-1.2.21/angular.js" does not match any file.
WARN [watcher]: Pattern "/usr/share/reepio/public/assets/js/angular-1.2.21/angular-route.js" does not match any file.
WARN [watcher]: Pattern "/usr/share/reepio/public/assets/js/angular-1.2.21/angular-animate.js" does not match any file.
WARN [watcher]: Pattern "/usr/share/reepio/public/assets/js/angular-1.2.21/angular-mocks.js" does not match any file.
WARN [watcher]: Pattern "/usr/share/reepio/public/assets/js/angulartics-0.16.1/src/angulartics.js" does not match any file.
WARN [watcher]: Pattern "/usr/share/reepio/public/assets/js/angulartics-0.16.1/src/angulartics-piwik.js" does not match any file.
WARN [watcher]: Pattern "/usr/share/reepio/public/config.js" does not match any file.
INFO [PhantomJS 1.9.8 (Linux)]: Connected on socket GxfJupCTwyL2VXRfLKHT
PhantomJS 1.9.8 (Linux) ERROR
ReferenceError: Can't find variable: jQuery
at /usr/share/reepio/public/assets/js/jquery.socialshareprivacy.js:443
PhantomJS 1.9.8 (Linux): Executed 0 of 0 ERROR (0.219 secs / 0 secs)
So when I look into assets/js folder
it does not find jquery or angular
there is no jquery or angular in those folders
Tim Durward
@TimDurward
Apr 25 2015 20:04
hmmmmm
did the npm start work?
bluenevus
@bluenevus
Apr 25 2015 20:05
error messages above when I started it
here are the npm test results

karma start karma.conf.js

INFO [karma]: Karma v0.10.10 server started at http://localhost:9876/
INFO [launcher]: Starting browser PhantomJS
WARN [watcher]: Pattern "/usr/share/reepio/public/assets/js/jquery-1.11.1.js" does not match any file.
WARN [watcher]: Pattern "/usr/share/reepio/public/assets/js/angular-1.2.21/angular.js" does not match any file.
WARN [watcher]: Pattern "/usr/share/reepio/public/assets/js/angular-1.2.21/angular-route.js" does not match any file.
WARN [watcher]: Pattern "/usr/share/reepio/public/assets/js/angular-1.2.21/angular-animate.js" does not match any file.
WARN [watcher]: Pattern "/usr/share/reepio/public/assets/js/angular-1.2.21/angular-mocks.js" does not match any file.
WARN [watcher]: Pattern "/usr/share/reepio/public/assets/js/angulartics-0.16.1/src/angulartics.js" does not match any file.
WARN [watcher]: Pattern "/usr/share/reepio/public/assets/js/angulartics-0.16.1/src/angulartics-piwik.js" does not match any file.
WARN [watcher]: Pattern "/usr/share/reepio/public/config.js" does not match any file.
INFO [PhantomJS 1.9.8 (Linux)]: Connected on socket f_xGxe16MUQGKXdxL97t
PhantomJS 1.9.8 (Linux) ERROR
ReferenceError: Can't find variable: jQuery
at /usr/share/reepio/public/assets/js/jquery.socialshareprivacy.js:443
PhantomJS 1.9.8 (Linux) ERROR
ReferenceError: Can't find variable: angular
at /usr/share/reepio/public/assets/js/ui-bootstrap-0.11.0.js:8
PhantomJS 1.9.8 (Linux) ERROR
ReferenceError: Can't find variable: angular
at /usr/share/reepio/public/modules/clipboard/module.js:5
PhantomJS 1.9.8 (Linux) ERROR
ReferenceError: Can't find variable: angular
at /usr/share/reepio/public/modules/common/module.js:25
PhantomJS 1.9.8 (Linux) ERROR
ReferenceError: Can't find variable: angular
at /usr/share/reepio/public/modules/download/module.js:25
PhantomJS 1.9.8 (Linux) ERROR
ReferenceError: Can't find variable: angular
at /usr/share/reepio/public/modules/static/module.js:25
PhantomJS 1.9.8 (Linux) ERROR
ReferenceError: Can't find variable: angular
at /usr/share/reepio/public/modules/upload/module.js:25
PhantomJS 1.9.8 (Linux) ERROR
ReferenceError: Can't find variable: angular
at /usr/share/reepio/public/modules/clipboard/clipboardDirective.js:5

Tim Durward
@TimDurward
Apr 25 2015 20:07
is the app/bower_components empty
bluenevus
@bluenevus
Apr 25 2015 20:07
no...there are many files in there
and folders
Tim Durward
@TimDurward
Apr 25 2015 20:07
did you run grunt
grunt is supposed to generate those files
bluenevus
@bluenevus
Apr 25 2015 20:09
yes, I ran grunt and can run it again
Tim Durward
@TimDurward
Apr 25 2015 20:09
sure try it one more time
bluenevus
@bluenevus
Apr 25 2015 20:11
here is the output

Running "ngAnnotate:angular" (ngAnnotate) task

1 file successfully generated.

Running "ngAnnotate:thirdparty" (ngAnnotate) task

1 file successfully generated.

Running "ngAnnotate:scripts" (ngAnnotate) task

1 file successfully generated.

Running "ngAnnotate:app" (ngAnnotate) task

1 file successfully generated.

Running "uglify:libs" (uglify) task
http://code.jquery.com/jquery-1.11.1.jshttp://code.jquery.com/jquery-1.11.1.js^C
root@ip-10-29-27-77:/usr/share/reepio/public/assets/js# grunt
Running "ngAnnotate:angular" (ngAnnotate) task

1 file successfully generated.

Running "ngAnnotate:thirdparty" (ngAnnotate) task

1 file successfully generated.

Running "ngAnnotate:scripts" (ngAnnotate) task

1 file successfully generated.

Running "ngAnnotate:app" (ngAnnotate) task

1 file successfully generated.

Running "uglify:libs" (uglify) task

Running "uglify:app" (uglify) task

Running "cssmin:theme" (cssmin) task
File dist/assets/css/theme.min.css created: 189.96 kB → 152.09 kB

Running "copy:main" (copy) task
Created 13 directories, copied 99 files

Running "imagemin:dynamic" (imagemin) task

Tim Durward
@TimDurward
Apr 25 2015 20:13
now check if those files appeared
bluenevus
@bluenevus
Apr 25 2015 20:13
no change...still wont run. I manually install jquery into the assets/js directory and that installed. angularjs 1x is still missing
Tim Durward
@TimDurward
Apr 25 2015 20:13
Well it says Running "copy:main" (copy) task Created 13 directories, copied 99 files
So the files and folders are being created
bluenevus
@bluenevus
Apr 25 2015 20:15
its the same files that were there before when I did grunt the first time
it appears I'm still missing angularjs in assets/js though
npm test results

reep.io@1.2.0 test /usr/share/reepio
karma start karma.conf.js

INFO [karma]: Karma v0.10.10 server started at http://localhost:9876/
INFO [launcher]: Starting browser PhantomJS
WARN [watcher]: Pattern "/usr/share/reepio/public/assets/js/angular-1.2.21/angular.js" does not match any file.
WARN [watcher]: Pattern "/usr/share/reepio/public/assets/js/angular-1.2.21/angular-route.js" does not match any file.
WARN [watcher]: Pattern "/usr/share/reepio/public/assets/js/angular-1.2.21/angular-animate.js" does not match any file.
WARN [watcher]: Pattern "/usr/share/reepio/public/assets/js/angular-1.2.21/angular-mocks.js" does not match any file.
WARN [watcher]: Pattern "/usr/share/reepio/public/assets/js/angulartics-0.16.1/src/angulartics.js" does not match any file.
WARN [watcher]: Pattern "/usr/share/reepio/public/assets/js/angulartics-0.16.1/src/angulartics-piwik.js" does not match any file.
WARN [watcher]: Pattern "/usr/share/reepio/public/config.js" does not match any file.
INFO [PhantomJS 1.9.8 (Linux)]: Connected on socket q8JjgHHAn89o9JfNOXAQ
PhantomJS 1.9.8 (Linux) ERROR
ReferenceError: Can't find variable: angular
at /usr/share/reepio/public/assets/js/ui-bootstrap-0.11.0.js:8
PhantomJS 1.9.8 (Linux) ERROR
ReferenceError: Can't find variable: angular
at /usr/share/reepio/public/modules/clipboard/module.js:5
PhantomJS 1.9.8 (Linux) ERROR
ReferenceError: Can't find variable: angular
at /usr/share/reepio/public/modules/common/module.js:25
PhantomJS 1.9.8 (Linux) ERROR
ReferenceError: Can't find variable: angular
at /usr/share/reepio/public/modules/download/module.js:25
PhantomJS 1.9.8 (Linux) ERROR
ReferenceError: Can't find variable: angular
at /usr/share/reepio/public/modules/static/module.js:25
PhantomJS 1.9.8 (Linux) ERROR
ReferenceError: Can't find variable: angular
at /usr/share/reepio/public/modules/upload/module.js:25
PhantomJS 1.9.8 (Linux) ERROR
ReferenceError: Can't find variable: angular
at /usr/share/reepio/public/modules/clipboard/clipboardDirective.js:5
PhantomJS 1.9.8 (Linux) ERROR
ReferenceError: Can't find variable: angular
at /usr/share/reepio/public/modules/common/converterService.js:8
PhantomJS 1.9.8 (Linux) ERROR
ReferenceError: Can't find variable: angular
at /usr/share/reepio/public/modules/common/crypto.js:25
PhantomJS 1.9.8 (Linux) ERROR
ReferenceError: Can't find variable: angular
at /usr/share/reepio/public/modules/common/detectCrawlerService.js:23
PhantomJS 1.9.8 (Linux) ERROR
ReferenceError: Can't find variable: angular
at /usr/share/reepio/public/modules/common/dialog.js:25
PhantomJS 1.9.8 (Linux) ERROR
ReferenceError: Can't find variable: angular
at /usr/share/reepio/public/modules/common/directives/fileIcon.js:61
PhantomJS 1.9.8 (Linux) ERROR
ReferenceError: Can't find variable: angular
at /usr/share/reepio/public/modules/common/directives/progressBar.js:25
PhantomJS 1.9.8 (Linux) ERROR
ReferenceError: Can't find variable: angular
at /usr/share/reepio/public/modules/common/directives/reepIoLogo.js:24
PhantomJS 1.9.8 (Linux) ERROR
ReferenceError: Can't find variable: angular
at /usr/share/reepio/public/modules/common/filters/fileFilters.js:25
PhantomJS 1.9.8 (Linux) ERROR
ReferenceError: Can't find variable: angular
at /usr/share/reepio/public/modules/common/filters/stringFilters.js:25
PhantomJS 1.9.8 (Linux) ERROR
ReferenceError: Can't find variable: angular
at /usr/share/reepio/public/modules/common/loading.js:25
PhantomJS 1.9.8 (Linux) ERROR
ReferenceError: Can't find variable: angular
at /usr/share/reepio/public/modules/common/notifications.js:25
PhantomJS 1.9.8 (Linux) ERROR
ReferenceError: Can't find variable: angular
at /usr/share/reepio/public/modules/common/randomService.js:23
PhantomJS 1.9.8 (Linux) ERROR
ReferenceError: Can't find variable: angular
at /usr/share/

Tim Durward
@TimDurward
Apr 25 2015 20:21
and assets/js folder is completely empty?
bluenevus
@bluenevus
Apr 25 2015 20:21
no...it had just a few files
let me list them
jquery.socialshareprivacy.js
paste.js
peer.js
socialshareprivacy
ui-bootstrap-0.11.0.js
I just download jquery-1.11.2.js and put it in the directory so that error stopped
Tim Durward
@TimDurward
Apr 25 2015 20:24
and is assets/bower_components there?
assets/js/ui-bootstrap-0.11.0.js
assets/js/jquery.socialshareprivacy.js
assets/js/paste.js/paste.js
assets/js/peer.js
Those are the only files required under assets/js
as long as you have assets/bower_components
bluenevus
@bluenevus
Apr 25 2015 20:27
peer.js is there, none of the other files are in assets/bower_components
Tim Durward
@TimDurward
Apr 25 2015 20:27
ah ok
see if bower install works
bluenevus
@bluenevus
Apr 25 2015 20:35
no logs
so this is what I just did
I just finished installing the right jquery version into the assets/js directory
I installed the right angular js version to the assets/js directory
and
I install angulartics version into the assets/js directory
npm test had 2 errors
it runs but doesn't generate a url
to share
Tim Durward
@TimDurward
Apr 25 2015 20:39
Well that's an ok idea. But that's masking up the main issue
bluenevus
@bluenevus
Apr 25 2015 20:39
it now hangs saying generating url
Tim Durward
@TimDurward
Apr 25 2015 20:40
can you try bower install --verbose
let me know if there is no logs
bluenevus
@bluenevus
Apr 25 2015 20:42
admin@ip-10-29-27-77:/usr/share/reepio$ bower install --verbose
? May bower anonymously report usage statistics to improve the tool over time? (? May bower anonymously report usage statistics to improve the tool over time? Yes
thats it
Tim Durward
@TimDurward
Apr 25 2015 20:44
whats your bower version at
bower -v
1.4.1?
bluenevus
@bluenevus
Apr 25 2015 20:44
1.4.1
Tim Durward
@TimDurward
Apr 25 2015 20:44
ok
try this
rm -rf assets/bower_components && bower install --verbose
bluenevus
@bluenevus
Apr 25 2015 20:45
nothing
no logs
no change in reepio either
same stuff in the bower_components directory
still doesn't generate a url
Tim Durward
@TimDurward
Apr 25 2015 20:47
what if you download my zipped file
one sec
bluenevus
@bluenevus
Apr 25 2015 20:48
downloading.
Tim Durward
@TimDurward
Apr 25 2015 20:48
Ok. I'm trying to figure out why this isn't working.
bluenevus
@bluenevus
Apr 25 2015 20:48
do you want remove the other reepio?
Tim Durward
@TimDurward
Apr 25 2015 20:48
Yeah
I put it on my windows/mac and linux system
They're all working. Hopefully the zip file might change something.
bluenevus
@bluenevus
Apr 25 2015 20:50
whew...this is painfully slow
Tim Durward
@TimDurward
Apr 25 2015 20:51
Hah! Yeah it is, my upload rate is 2.2mbs though. Is your internet slow?
bluenevus
@bluenevus
Apr 25 2015 20:53
my download rate is 36mb
but this file is downloading at 250kbps
Tim Durward
@TimDurward
Apr 25 2015 20:57
Did it finish downloading?
bluenevus
@bluenevus
Apr 25 2015 20:57
yes
I'm going to wget it and unrar
Tim Durward
@TimDurward
Apr 25 2015 20:58
Alright! :]
bluenevus
@bluenevus
Apr 25 2015 21:05
having some problem with rar fle
going to repack it
Tim Durward
@TimDurward
Apr 25 2015 21:08
Ok, once you can open it. Remove the node_modules
then npm install
then run grunt
You'll to open karma.conf.js
and replace everything with
This message was deleted
module.exports = function (config) {
    config.set({

        basePath: './',

        files: [
            'public/assets/js/jquery-1.11.1.js',
            'public/assets/js/angular-1.2.21/angular.js',
            'public/assets/js/angular-1.2.21/angular-route.js',
            'public/assets/js/angular-1.2.21/angular-animate.js',
            'public/assets/js/angular-1.2.21/angular-mocks.js',
            'public/assets/js/angulartics-0.16.1/src/angulartics.js',
            'public/assets/js/angulartics-0.16.1/src/angulartics-piwik.js',
            'public/assets/js/*.js',
            'public/assets/js/ui-bootstrap-0.11.0.js',
            'public/modules/**/module.js',
            'public/modules/**/*.js',
            'public/config.js',
            'public/app.js',
            'tests/**/*_test.js'
        ],

        autoWatch: true,

        frameworks: ['jasmine'],

        browsers: ['PhantomJS'],

        plugins: [
                        'karma-phantomjs-launcher',
            'karma-chrome-launcher',
            'karma-firefox-launcher',
            'karma-ie-launcher',
            'karma-jasmine',
            'karma-junit-reporter'
        ],

        junitReporter: {
            outputFile: 'test_out/unit.xml',
            suite: 'unit'
        }

    });
};
This message was deleted
bluenevus
@bluenevus
Apr 25 2015 21:13
ok
Tim Durward
@TimDurward
Apr 25 2015 21:21
Let me know when you're finished :)
bluenevus
@bluenevus
Apr 25 2015 21:22
ok...
bluenevus
@bluenevus
Apr 25 2015 21:55
sorry its taking so long. I had a problem with unrar free opening the rar so I finally updated the sources.list to get non-free rar. it finally unzipped and its running install now
grunt running
wheew
bluenevus
@bluenevus
Apr 25 2015 22:05
grunt is failing to build the files
Tim Durward
@TimDurward
Apr 25 2015 22:07
You need to change karma.conf.js
module.exports = function (config) {
    config.set({

        basePath: './',

        files: [
            'public/assets/js/jquery-1.11.1.js',
            'public/assets/js/angular-1.2.21/angular.js',
            'public/assets/js/angular-1.2.21/angular-route.js',
            'public/assets/js/angular-1.2.21/angular-animate.js',
            'public/assets/js/angular-1.2.21/angular-mocks.js',
            'public/assets/js/angulartics-0.16.1/src/angulartics.js',
            'public/assets/js/angulartics-0.16.1/src/angulartics-piwik.js',
            'public/assets/js/*.js',
            'public/assets/js/ui-bootstrap-0.11.0.js',
            'public/modules/**/module.js',
            'public/modules/**/*.js',
            'public/config.js',
            'public/app.js',
            'tests/**/*_test.js'
        ],

        autoWatch: true,

        frameworks: ['jasmine'],

        browsers: ['PhantomJS'],

        plugins: [
                        'karma-phantomjs-launcher',
            'karma-chrome-launcher',
            'karma-firefox-launcher',
            'karma-ie-launcher',
            'karma-jasmine',
            'karma-junit-reporter'
        ],

        junitReporter: {
            outputFile: 'test_out/unit.xml',
            suite: 'unit'
        }

    });
};
```
bluenevus
@bluenevus
Apr 25 2015 22:08
I did

Running "imagemin:dynamic" (imagemin) task
Warning: spawn /usr/share/reepio/node_modules/grunt-contrib-imagemin/node_modules/imagemin/node_modules/imagemin-optipng/node_modules/optipng-bin/vendor/optipng ENOENT Use --force to continue.

Aborted due to warnings.

this is where it fails
I used force also
I
I'll past the logs with thee force option

root@ip-10-29-27-77:/usr/share/reepio# grunt --force
Running "ngAnnotate:angular" (ngAnnotate) task

1 file successfully generated.

Running "ngAnnotate:thirdparty" (ngAnnotate) task

1 file successfully generated.

Running "ngAnnotate:scripts" (ngAnnotate) task

1 file successfully generated.

Running "ngAnnotate:app" (ngAnnotate) task

1 file successfully generated.

Running "uglify:libs" (uglify) task

Running "uglify:app" (uglify) task

Running "cssmin:theme" (cssmin) task
File dist/assets/css/theme.min.css created: 199.03 kB → 152.09 kB

Running "copy:main" (copy) task
Created 13 directories, copied 99 files

Running "imagemin:dynamic" (imagemin) task
Warning: spawn /usr/share/reepio/node_modules/grunt-contrib-imagemin/node_modules/imagemin/node_modules/imagemin-optipng/node_modules/optipng-bin/vendor/optipng ENOENT Used --force, continuing.
Fatal error: Cannot read property 'contents' of undefined

Tim Durward
@TimDurward
Apr 25 2015 22:10
did you do npm install?
bluenevus
@bluenevus
Apr 25 2015 22:10
yes
Tim Durward
@TimDurward
Apr 25 2015 22:10
and removed node_modules?
bluenevus
@bluenevus
Apr 25 2015 22:11
I did not remove node_modules
Tim Durward
@TimDurward
Apr 25 2015 22:11
Remove those
bluenevus
@bluenevus
Apr 25 2015 22:11
the whole folder or just contents?
Tim Durward
@TimDurward
Apr 25 2015 22:11
the whole folder
bluenevus
@bluenevus
Apr 25 2015 22:11
done
npm install
running
Tim Durward
@TimDurward
Apr 25 2015 22:12
afterwards run grunt
bluenevus
@bluenevus
Apr 25 2015 22:12
ok
I'll be back in about 2 hours. need to take my kids to an event. i'll let you know the results
Tim Durward
@TimDurward
Apr 25 2015 22:14
Ok :)
Have fun!