These are chat archives for TypeStrong/atom-typescript

18th
Sep 2015
Ranjit Jhala
@ranjitjhala
Sep 18 2015 00:37
This message was deleted

Hi all, my atom-typescript mysteriously stopped working with this:

In file included from ../fsevents.cc:6:
In file included from ../node_modules/nan/nan.h:74:
In file included from ../node_modules/nan/nan_new.h:181:
../node_modules/nan/nan_implementation_12_inl.h:172:66: error: too many arguments to function call, expected at most 2, have 4
  return v8::Signature::New(v8::Isolate::GetCurrent(), receiver, argc, argv);
         ~~~~~~~~~~~~~~~~~~                                      ^~~~~~~~~~
/Users/rjhala/.atom/.node-gyp/.node-gyp/0.30.6/deps/v8/include/v8.h:4515:3: note: 'New' declared here
  static Local<Signature> New(
  ^
1 error generated.
make: *** [Release/obj.target/fse/fsevents.o] Error 1
gyp ERR! build error 
gyp ERR! stack Error: `make` failed with exit code: 2
gyp ERR! stack     at ChildProcess.onExit (/Applications/Atom.app/Contents/Resources/app/apm/node_modules/npm/node_modules/node-gyp/lib/build.js:269:23)
gyp ERR! stack     at ChildProcess.emit (events.js:98:17)
gyp ERR! stack     at Process.ChildProcess._handle.onexit (child_process.js:810:12)
gyp ERR! System Darwin 14.5.0
gyp ERR! command "node" "/Applications/Atom.app/Contents/Resources/app/apm/node_modules/npm/node_modules/node-gyp/bin/node-gyp.js" "rebuild"
gyp ERR! cwd /Users/rjhala/.atom/packages/atom-typescript/node_modules/grunt-ts/node_modules/chokidar/node_modules/fsevents
gyp ERR! node -v v0.10.30
gyp ERR! node-gyp -v v2.0.2
gyp ERR! not ok 

npm ERR! Darwin 14.5.0
npm ERR! argv "/Applications/Atom.app/Contents/Resources/app/apm/bin/node" "/Applications/Atom.app/Contents/Resources/app/apm/node_modules/npm/bin/npm-cli.js" "--globalconfig" "/Users/rjhala/.atom/.apm/.apmrc" "--userconfig" "/Users/rjhala/.atom/.apmrc" "rebuild" "--target=0.30.6" "--arch=x64"
npm ERR! node v0.10.40
npm ERR! npm  v2.13.3
npm ERR! code ELIFECYCLE
npm ERR! fsevents@0.3.5 install: `node-gyp rebuild`
npm ERR! Exit status 1
npm ERR! 
npm ERR! Failed at the fsevents@0.3.5 install script 'node-gyp rebuild'.
npm ERR! This is most likely a problem with the fsevents package,
npm ERR! not with npm itself.
npm ERR! Tell the author that this fails on your system:
npm ERR!     node-gyp rebuild
npm ERR! You can get their info via:
npm ERR!     npm owner ls fsevents
npm ERR! There is likely additional logging output above.

npm ERR! Please include the following file with any support request:
npm ERR!     /Users/rjhala/.atom/packages/atom-typescript/npm-debug.log

Any idea whats going on?

Basarat Ali Syed
@basarat
Sep 18 2015 00:56
@ranjitjhala Has to be some library (here : https://github.com/TypeStrong/atom-typescript/blob/master/package.json#L43-L59) that does file watching ... and is using an older version of fsevents that no longer compiles.
@ranjitjhala a longer log + issue report would help :rose:
Ranjit Jhala
@ranjitjhala
Sep 18 2015 01:25
@basarat -- thanks, will post issue asap!
Ranjit Jhala
@ranjitjhala
Sep 18 2015 02:26
Hi @basarat -- just posted TypeStrong/atom-typescript#583
Basarat Ali Syed
@basarat
Sep 18 2015 05:20
@ranjitjhala reply was posted in issue
kpgarrod
@kpgarrod
Sep 18 2015 07:53
Help! My atom-typescript is broken. I just updated Atom to 1.0.13 and atom-typescript to 6.0.10 and I get a bug icon in the bottom-right
"Some installed packages could not be loaded because they contain native modules that were compiled for an earlier version of Atom.Rebuild Packages"
I tried rebuilding packages but it didn't work
kpgarrod
@kpgarrod
Sep 18 2015 10:16
tried removing and reinstalling the plugin - that didn't work either
Ranjit Jhala
@ranjitjhala
Sep 18 2015 11:43
@kpgarrod -- you might be having the same issue as me. (I had similar symptoms, click the "rebuild packages" to see if its this or something else)