Where communities thrive


  • Join over 1.5M+ people
  • Join over 100K+ communities
  • Free without limits
  • Create your own community
People
Repo info
Activity
    Ronaldo
    @ronaldo-elgrocer
    how to run appium in github actions
    Adam Bethlehem
    @adambeth

    Can anyone assist me with this error when running appium with testng and maven
    java.lang.RuntimeException: java.lang.NoSuchMethodException: jdk.proxy2.$Proxy10.proxyClassLookup()

    Ive tried literally every version of java with no luck,
    at io.appium.java_client.pagefactory.bys.builder.AppiumByBuilder.prepareAnnotationMethods(AppiumByBuilder.java:85)

    it is failing when it tries to initialize a PageObject
    any help would be greatly appreciated

    It works fine when running via intellij testng runner but via the terminal: mvn test
    jyoti manghnani
    @jyotimanghnani_gitlab
    Hi..
    I want to automate selecting toggle button using appium but the xpaths used by me r giving "nosuchelementexception.
    I am using this xapth as text is not given in the tree. "//*[contains(@resource-id,'id/toggle')]"
    Timothy Boland
    @TimB0
    so to make sure im not crazy....for XCUITests the only way to reset the app in between tests is to uninstall and reinstall?
    Ninja2SuS
    @Ninja2SuS
    i need help making movie streaming a[[
    app
    RifkiNurgraha
    @RifkiNurgraha

    Hi Anyone can help, im using ,webdriverio": "^7.11.1", @wdio/appium-service": "^7.11.1", and when run always got ->

    'POST /element' cannot be proxied to UiAutomator2 server because the instrumentation process is not running (probably crashed). Check the server log and/or the logcat output for more details

    SaMkiT Sharma
    @samkitsharma_twitter

    Hey guys,

    I came across this hack challenge for enhancing Android libraries. I thought of sharing it with you all. It has a cash prize of up to 10 lakh rupees.

    I submitted my idea. You guys can also participate.

    https://www.incubateind.com/hack/libathon

    Vlad Danilov
    @danilovxp

    Hi all,
    how can I enter text with 0.5-1 second delay? setValue() doesn't work for me, because dropDown doesn't appear after setValue().

    The method below returns the wrong characters.

    text = 'karm'

    WebDriverIO, Appium, iOS driver = XCUITest, Adndroid driver = UIAutomator2

       public static type(element, text, isErase = true, maxDelay = 500) {
        element.click()
        driver.pause(500)
        if (isErase) {
          element.setValue('')
        }
    
        const charList = text.split('')
    
        for (let i = 0; i  <charList.length; i++) {
          driver.pressKeyCode(charList[i].charCodeAt())
          driver.pause(Math.floor(Math.random() * maxDelay))
        }
      }

    In output I got something like yv...'

    владимир иванович архипов
    @vova557
    не кто мне не может помочь с администрацией бизнеса в интернете ?ъ
    Optimerz
    @Optimerz
    hello anybody here?
    I have the problem with this error can someone help me please I'm really need the help me please : io.appium.uiautomator2.common.exceptions.InvalidArgumentException: 'capabilities' are mandatory for session creation
    1 reply
    cnerkar1859
    @cnerkar1859
    Hi Guys, can we scroll in ios till element is found without using direction , as we need to specify direction as up or down, I want to scroll by element doesn't matter where it is on the screen for ios.
    Kaique Silveira
    @kiiqsilveira
    Hi, can anybody tell me if appium currently supports the iOS 15 (xcode 13)?
    1 reply
    sadhananda
    @sadhananda
    Hi..is it possible to automate ios using appium on ubuntu system?
    sumitmalviya784
    @sumitmalviya784
    Hi All, I am trying to launch an iOS simulator with the latest iOS version i.e. iOS 15 with Appium 1.21.0, and getting "ECONNREFUSED 127.0.0.1:8100" It was working fine with iOS 14.
    Ezreal
    @lucky06688
    Hi All, does Appium support automating hybrid apps on Windows and Mac? I noticed that getContextHandles and context are not available on Mac and Windows(https://appium.io/docs/en/writing-running-appium/web/hybrid/). Does this mean that Appium cannot be used for hybrid apps on the desktop? Are there other ways to workaround?
    thanhhuynh672
    @thanhhuynh672
    0xD4d826239532542A6D5E6f7B4d1C3415b4Bf4760
    deepkawal
    @deepkawal
    Anyone doing C# mobile native test automation using specflow/Gherkin or any other recommended way of doing BDD? Please share your experiences? I am trying to implement things from scratch so any pointers/experiences would be helpful
    Sayak Kundu
    @sayak119

    Hi. While testing for basic auth on an iOS device, found that with Appium 1.21.0, the basic auth feature is not working. I am doing the following -

    1. Go to https://guest:guest@jigsaw.w3.org/HTTP/Basic/
    2. Print title

    For other Appium versions (example - 1.17.0), I get the page title. But for Appium 1.21.0, it comes out as empty. Do tell me if logs are needed for the same.

    Łukasz Przybylski
    @lukasz.przybylki:matrix.org
    [m]
    Hi Guys!! Is it possible to find element using Appium with Android JetPack Compose ? I mean by resource ID, not contentDescription. Thank you!
    Temporal Wolf
    @TemporalWolf_twitter
    Running wdio against appium and every time we try to switch context appium fails to start chromedriver with the error
    InvalidArgumentError: invalid argument: cannot parse capability: chromeOptions from invalid argument: unrecognized chrome option: androidDeviceSerial
    I suspect this might be a backward compatibility issue, as we're using an embedded system with chrome 74 (and thus chromedriver 74) but we've been unable to resolve this. Any ideas?
    The issue is that androidDeviceSerial is an option Appium adds automatically to the chromeOptions. I haven't found a way to disable this.
    Diego Chavez
    @Diego-18

    Good afternoon I am doing maintenance to an android application and when I try to run it generates the following error:

    A problem occurred while evaluating the ':app' project.

    No method signature: build_8an4x2x2y9wjeapitti2nrs3dls.android() is applicable for argument types: (build_8an4x2y9wjeapitti2nrs3dls$_run_closure1) values: [build_8an4x2y9wjeapitti2nrs3dls$_run_closure1@e26d03a]

    Has anyone had the same thing happen to them?

    SSRIKAN
    @SSRIKAN
    image.png
    Joseph Pentland
    @jpentland
    When starting an android application, I get the error "'com.package.MainActivity' never started". However I see that the app did in fact start, but it is waiting for input. Can I just skip the error and begin automation?
    2 replies
    Joseph Pentland
    @jpentland
    ahh i suppose i can just diable autoLaunch
    MraxisTheGaul
    @MraxisTheGaul
    Hey all is there way to check if the elements have Accesibility ID or normal ID in a way ? I am checking them manually atm as if the element is clickable and doesn't have accesiblity or normal id then i send them to dev team to add the accesibility id but as i said manually it takes way too long.
    1 reply
    Muhammad Habib
    @MHabiib
    image.png
    Hi guys!, want to know is it possible to change the emulator default image with any image from emulator storage using appium and serenity. try to automate scanning qr code
    Dalilaroussi
    @Dalilaroussi
    Hi all , how to activate Bluetooth on iOS , I do not want open preferences and click element switch button , how I can enabled via script or shell ? , On Android devices I found a solution how to enable it via shell but on XCUITest command there is no command shell , any suggestions ?
    Jyoti Pandey
    @jp833
    Is it possible to navigate the camera virtual scene on Android emulator?
    I have not been able to achieve it using Alt+D using LongPressKeyCode or PressKeyCode.
    Anurag Soni
    @asonitrip
    While running tests, script installs APP but WDA is not getting installed its in Grey color.
    Please help.
    [W3C] Encountered internal error running command: Error: Unable to start WebDriverAgent session because of xcodebuild failure: The requested resource could not be found, or a request was received using an HTTP method that is not supported by the mapped resource
    [W3C] at quitAndUninstall (/Applications/Appium.app/Contents/Resources/app/node_modules/appium/node_modules/appium-xcuitest-driver/lib/driver.js:544:15)
    Screen Shot 2021-11-11 at 8.44.43 PM.png
    Pooja
    @Pooja16273761_twitter
    image.png

    Hello Everyone , I am trying to run tests on ios simulator
    I am getting bellow error
    [WD Proxy] connect ECONNREFUSED 127.0.0.1:8100
    [debug] [XCUITest] Failed to create WDA session (An unknown server-side error occurred while processing the command. Original error: Could not proxy command to the remote server. Original error: connect ECONNREFUSED 127.0.0.1:8100)

    can someone please help.

    2 replies
    Ronald Paolo Ramirez
    @rptramirez
    Hi Everyone hope to collaborate with developers soon I am currently studying angular and ts-node
    Thanh Tra
    @ThanhTra1
    image.png
    Hi, I am getting error when trying switch to facebook app
    please help
    my scenario : 1. open a native app
    click login by facebook
    and i try to switch to facebook app to login but it show that bug
    Inês Moreira
    @simoreira
    Hey! Has anyone ever faced the issue of WDA crashing when setting snapshotMaxDepth to values higher than 62?
    3 replies
    kostyll
    @kostyll
    Hi everyone. Are there any examples with docker-compose files to automate CI/DI with appium in giltab ? e.g - simmulate data-input, buttons clicks, take screenshots, get received fcm-notifications & simmulate sms receive for ... not on real device but within emulator
    Charlie Lin
    @charlielinz
    Hi everyone, is there any one meet the situation as below:
    I can select element invisible
    I mean I can see it on screen but selector can grab it
    the invisible element should not be in this page