Where communities thrive


  • Join over 1.5M+ people
  • Join over 100K+ communities
  • Free without limits
  • Create your own community
People
Repo info
Activity
  • May 25 04:51

    dependabot[bot] on maven

    (compare)

  • May 25 04:51
    dependabot[bot] closed #47
  • May 25 04:51
    dependabot[bot] commented #47
  • May 25 04:51
    dependabot[bot] labeled #50
  • May 25 04:51
    dependabot[bot] opened #50
  • May 25 04:51

    dependabot[bot] on maven

    Bump spring-core Bumps [spring… (compare)

  • May 25 04:14

    dependabot[bot] on maven

    (compare)

  • May 25 04:14
    dependabot[bot] closed #46
  • May 25 04:14
    dependabot[bot] commented #46
  • May 25 04:14
    dependabot[bot] labeled #49
  • May 25 04:14
    dependabot[bot] opened #49
  • May 25 04:14

    dependabot[bot] on maven

    Bump spring-core Bumps [spring… (compare)

  • May 20 20:51
    dependabot[bot] labeled #48
  • May 20 20:51
    dependabot[bot] opened #48
  • May 20 20:51

    dependabot[bot] on maven

    Bump gson in /functional test a… (compare)

  • Apr 22 23:31

    dependabot[bot] on maven

    (compare)

  • Apr 22 23:31
    dependabot[bot] closed #45
  • Apr 22 23:31
    dependabot[bot] commented #45
  • Apr 22 23:31
    dependabot[bot] labeled #47
  • Apr 22 23:31
    dependabot[bot] opened #47
Hemanathan
@Gamaiva
Hemanathan-Mac:Lea_iOS_113 Hema$ appium
[Appium] Welcome to Appium v1.6.4-beta
[Appium] Appium REST http interface listener started on 0.0.0.0:4723
[HTTP] --> POST /wd/hub/session {"capabilities":{"desiredCapabilities":{"app":"/Users/user/Desktop/Lea_iOS/ios.ipa","bootstrappath":"/usr/local/lib/node_modules/appium/node_modules/appium-xcuitest-driver/WebDriverAgent","agentpath":"/usr/local/lib/node_modules/appium/node_modules/appium-xcuitest-driver/WebDriverAgent/WebDriverAgent.xcodeproj","appiumVersion":"1.6.4","platformVersion":"10.2.1","automationName":"XCuiTest","browserName":"","platformName":"iOS","udid":"e1466b58af9cf7811d24e9f3ac19c62a228d253e","deviceName":"iPhone","launchTimeout":500000},"requiredCapabilities":{}},"desiredCapabilities":{"app":"/Users/user/Desktop/Lea_iOS/ios.ipa","bootstrappath":"/usr/local/lib/node_modules/appium/node_modules/appium-xcuitest-driver/WebDriverAgent","agentpath":"/usr/local/lib/node_modules/appium/node_modules/appium-xcuitest-driver/WebDriverAgent/WebDriverAgent.xcodeproj","appiumVersion":"1.6.4","platformVersion":"10.2.1","automationName":"XCuiTest","browserName":"","platformName":"iOS","udid":"e1466b58af9cf7811d24e9f3ac
[debug] [MJSONWP] Calling AppiumDriver.createSession() with args: [{"app":"/Users/user/Desktop/Lea_iOS/ios.ipa","bootstrappath":"/usr/local/lib/node_modules/appium/node_modules/appium-xcuitest-driver/WebDriverAgent","agentpath":"/usr/local/lib/node_modules/appium/node_modules/appium-xcuitest-driver/WebDriverAgent/WebDriverAgent.xcodeproj","appiumVersion":"1.6.4","platformVersion":"10.2.1","automationName":"XCuiTest","browserName":"","platformName":"iOS","udid":"e1466b58af9cf7811d24e9f3ac19c62a228d253e","deviceName":"iPhone","launchTimeout":500000},{},{"desiredCapabilities":{"app":"/Users/user/Desktop/Lea_iOS/ios.ipa","bootstrappath":"/usr/local/lib/node_modules/appium/node_modules/appium-xcuitest-driver/WebDriverAgent","agentpath":"/usr/local/lib/node_modules/appium/node_modules/appium-xcuitest-driver/WebDriverAgent/WebDriverAgent.xcodeproj","appiumVersion":"1.6.4","platformVersion":"10.2.1","automationName":"XCuiTest","browserName":"","platformName":"iOS","udid":"e1466b58af9cf7811d24e9f3ac19c62a228d253e","deviceName":"iPhone","launchTimeout":500000},"requiredCapabilitie...
[debug] [BaseDriver] Event 'newSessionRequested' logged at 1494497656857 (15:44:16 GMT+0530 (IST))
[Appium] Creating new XCUITestDriver (v2.21.0) session
[Appium] Capabilities:
[Appium] app: '/Users/user/Desktop/Lea_iOS/ios.ipa'
[Appium] bootstrappath: '/usr/local/lib/node_modules/appium/node_modules/appium-xcuitest-driver/WebDriverAgent'
[Appium] agentpath: '/usr/local/lib/node_modules/appium/node_modules/appium-xcuitest-driver/WebDriverAgent/WebDriverAgent.xcodeproj'
[Appium] appiumVersion: '1.6.4'
[Appium] platformVersion: '10.2.1'
[Appium] automationName: 'XCuiTest'
[Appium] browserName: ''
[Appium] platformName: 'iOS'
[Appium] udid: 'e1466b58af9cf7811d24e9f3ac19c62a228d253e'
[Appium] deviceName: 'iPhone'
[Appium] launchTimeout: 500000
[debug] [XCUITest] XCUITestDriver version: 2.21.0
[BaseDriver] The following capabilities were provided, but are not recognized by appium: bootstrappath, agentpath, appiumVersion.
[BaseDriver] Session created with session id: 10bd7d8d-9d11-4c45-bcc0-6736c9c56e94
[debug] [XCUITest] Xcode version set to '8.2.1' (tools v8.3.0.0.1.1490382677)
[debug] [XCUITest] iOS SDK Version set to '10.2'
[debug] [BaseDriver] Event 'xcodeDetailsRetrieved' logged at 1494497662013 (15:44:22 GMT+0530 (IST))
[debug] [XCUITest] Available devices: e1466b58af9cf7811d24e9f3ac19c62a228d253e
[debug] [XCUITest] Creating iDevice object with udid 'e1466b58af9cf7811d24e9f3ac19c62a228d253e'
[XCUITest] Determining device to run tests on: udid: 'e1466b58af9cf7811d24e9f3ac19c62a228d253e', real device: true
[BaseDriver] Using local app '/Users/user/Desktop/Lea_iOS/ios.ipa'
[debug] [BaseDriver] Copying local zip to tmp dir
[debug] [BaseDriver] Unzipping /var/folders/_s/k530qw155179_ch8ctcg4z4w0000gp/T/2017411-2887-1w23icy.yd7cgfd2t9/appium-app.zip
[debug] [BaseDriver] Testin
here I smy fulll log
Manikandan M G
@mgmanikandan87
this is not full log
some thing missed
below
Hemanathan
@Gamaiva
wait
Hemanathan
@Gamaiva
[debug] [BaseDriver] Testing zip archive: /var/folders/_s/k530qw155179_ch8ctcg4z4w0000gp/T/2017411-2887-1w23icy.yd7cgfd2t9/appium-app.zip
[BaseDriver] Unzipped local app to '/var/folders/_s/k530qw155179_ch8ctcg4z4w0000gp/T/2017411-2887-1w23icy.yd7cgfd2t9/Payload/Lea_iOS.app'
[debug] [BaseDriver] Event 'appConfigured' logged at 1494497675645 (15:44:35 GMT+0530 (IST))
[debug] [XCUITest] Checking whether app '/var/folders/_s/k530qw155179_ch8ctcg4z4w0000gp/T/2017411-2887-1w23icy.yd7cgfd2t9/Payload/Lea_iOS.app' is actually present on file system
[debug] [XCUITest] App is present
[debug] [iOS] Getting bundle ID from app '/var/folders/_s/k530qw155179_ch8ctcg4z4w0000gp/T/2017411-2887-1w23icy.yd7cgfd2t9/Payload/Lea_iOS.app': 'com.madebyfire.lea.dev'
[debug] [BaseDriver] Event 'resetStarted' logged at 1494497675652 (15:44:35 GMT+0530 (IST))
[debug] [XCUITest] Reset: running ios real device reset flow
[debug] [BaseDriver] Event 'resetComplete' logged at 1494497675653 (15:44:35 GMT+0530 (IST))
[debug] [iOSLog] Attempting iOS device log capture via libimobiledevice idevicesyslog
[debug] [iOSLog] Found idevicesyslog: '/usr/local/bin/idevicesyslog'
[debug] [BaseDriver] Event 'logCaptureStarted' logged at 1494497678578 (15:44:38 GMT+0530 (IST))
[XCUITest] Setting up real device
[debug] [XCUITest] Reset requested. Removing app with id 'com.madebyfire.lea.dev' from the device
[debug] [XCUITest] Installing '/var/folders/_s/k530qw155179_ch8ctcg4z4w0000gp/T/2017411-2887-1w23icy.yd7cgfd2t9/Payload/Lea_iOS.app' on device with UUID 'e1466b58af9cf7811d24e9f3ac19c62a228d253e'...
[debug] [XCUITest] The app has been installed successfully.
[debug] [BaseDriver] Event 'appInstalled' logged at 1494497689717 (15:44:49 GMT+0530 (IST))
[debug] [BaseDriver] Event 'wdaStartAttempted' logged at 1494497689720 (15:44:49 GMT+0530 (IST))
[XCUITest] Using WDA path: '/usr/local/lib/node_modules/appium/node_modules/appium-xcuitest-driver/WebDriverAgent'
[XCUITest] Using WDA agent: '/usr/local/lib/node_modules/appium/node_modules/appium-xcuitest-driver/WebDriverAgent/WebDriverAgent.xcodeproj'
[XCUITest] Launching WebDriverAgent on the device
[debug] [XCUITest] Carthage found: '/usr/local/bin/carthage'
[debug] [XCUITest] Killing hanging processes
[debug] [XCUITest] Beginning test with command 'xcodebuild build-for-testing test-without-building -project /usr/local/lib/node_modules/appium/node_modules/appium-xcuitest-driver/WebDriverAgent/WebDriverAgent.xcodeproj -scheme WebDriverAgentRunner -destination id=e1466b58af9cf7811d24e9f3ac19c62a228d253e -configuration Debug' in directory '/usr/local/lib/node_modules/appium/node_modules/appium-xcuitest-driver/WebDriverAgent'
[debug] [XCUITest] Output from xcodebuild will not be logged
[debug] [XCUITest] Starting iproxy to forward traffic from local port 8100 to device port 8100 over USB
[debug] [XCUITest] Waiting up to 60000ms for WebDriverAgent to start
[debug] [JSONWP Proxy] Proxying [GET /status] to [GET http://localhost:8100/status] with no body
[debug] [JSONWP Proxy] Proxying [GET /status] to [GET http://localhost:8100/status] with no body
[debug] [JSONWP Proxy] Proxying [GET /status] to [GET http://localhost:8100/status] with no body
[debug] [JSONWP Proxy] Proxying [GET /status] to [GET http://localhost:8100/status] with no body
[debug] [JSONWP Proxy] Proxying [GET /status] to [GET http://localhost:8100/status] with no body
[debug] [JSONWP Proxy] Proxying [GET /status] to [GET http://localhost:8100/status] with no body
[debug] [JSONWP Proxy] Proxying [GET /status] to [GET http://localhost:8100/status] with no body
[debug] [JSONWP Proxy] Proxying [GET /status] to [GET http://localhost:8100/status] with no body
[debug] [JSONWP Proxy] Proxying [GET /status] to [GET http://localhost:8100/status] with no body
[debug] [JSONWP Proxy] Proxying [GET /status] to [GET http://localhost:8100/status] with no body
[debug] [JSONWP Proxy] Proxying [GET /status] to [GET http://localhost:8100/status] with no body
[debug] [JSONWP Proxy] Proxying [GET /status] to [GET http://localhost:8100/status] with no body
[debug] [JSONWP Proxy] Proxyi
[debug] [JSONWP Proxy] Proxying [GET /status] to [GET http://localhost:8100/status] with no body
[debug] [JSONWP Proxy] Proxying [GET /status] to [GET http://localhost:8100/status] with no body
[debug] [JSONWP Proxy] Proxying [GET /status] to [GET http://localhost:8100/status] with no body
[debug] [JSONWP Proxy] Proxying [GET /status] to [GET http://localhost:8100/status] with no body
[debug] [JSONWP Proxy] Proxying [GET /status] to [GET http://localhost:8100/status] with no body
[debug] [JSONWP Proxy] Proxying [GET /status] to [GET http://localhost:8100/status] with no body
[debug] [JSONWP Proxy] Proxying [GET /status] to [GET http://localhost:8100/status] with no body
[debug] [JSONWP Proxy] Proxying [GET /status] to [GET http://localhost:8100/status] with no body
[debug] [JSONWP Proxy] Proxying [GET /status] to [GET http://localhost:8100/status] with no body
[debug] [JSONWP Proxy] Proxying [GET /status] to [GET http://localhost:8100/status] with no body
[debug] [JSONWP Proxy] Proxying [GET /status] to [GET http://localhost:8100/status] with no body
[debug] [JSONWP Proxy] Proxying [GET /status] to [GET http://localhost:8100/status] with no body
[debug] [JSONWP Proxy] Proxying [GET /status] to [GET http://localhost:8100/status] with no body
[debug] [JSONWP Proxy] Proxying [GET /status] to [GET http://localhost:8100/status] with no body
[debug] [JSONWP Proxy] Proxying [GET /status] to [GET http://localhost:8100/status] with no body
[debug] [JSONWP Proxy] Proxying [GET /status] to [GET http://localhost:8100/status] with no body
[debug] [JSONWP Proxy] Proxying [GET /status] to [GET http://localhost:8100/status] with no body
[Xcode] 2017-05-11 15:45:40.319 xcodebuild[3241:376650] Error Domain=IDETestOperationsObserverErrorDomain Code=5 "Early unexpected exit, operation never finished bootstrapping - no restart will be attempted" UserInfo={NSLocalizedDescription=Early unexpected exit, operation never finished bootstrapping - no restart will be attempted}
[Xcode]
[Xcode] TEST EXECUTE FAILED
[Xcode]
[Xcode]
[debug] [JSONWP Proxy] Proxying [GET /status] to [GET http://localhost:8100/status] with no body
[XCUITest] xcodebuild exited with code '65' and signal 'null'
[debug] [BaseDriver] Event 'wdaStartFailed' logged at 1494497740626 (15:45:40 GMT+0530 (IST))
[debug] [XCUITest] Unable to launch WebDriverAgent because of xcodebuild failure: xcodebuild failed with code 65
[debug] [XCUITest] Quitting and uninstalling WebDriverAgent, then retrying
[XCUITest] Shutting down sub-processes
[XCUITest] Shutting down iproxy process (pid 3240)
[debug] [XCUITest] iproxy exited with code 'null'
[debug] [XCUITest] Removing WDA application from device
[debug] [BaseDriver] Event 'wdaStartAttempted' logged at 1494497751350 (15:45:51 GMT+0530 (IST))
[XCUITest] Using WDA path: '/usr/local/lib/node_modules/appium/node_modules/appium-xcuitest-driver/WebDriverAgent'
[XCUITest] Using WDA agent: '/usr/local/lib/node_modules/appium/node_modules/appium-xcuitest-driver/WebDriverAgent/WebDriverAgent.xcodeproj'
[XCUITest] Launching WebDriverAgent on the device
[debug] [XCUITest] Carthage found: '/usr/local/bin/carthage'
[debug] [XCUITest] Killing hanging processes
[debug] [XCUITest] Beginning test with command 'xcodebuild build-for-testing test-without-building -project /usr/local/lib/node_modules/appium/node_modules/appium-xcuitest-driver/WebDriverAgent/WebDriverAgent.xcodeproj -scheme WebDriverAgentRunner -destination id=e1466b58af9cf7811d24e9f3ac19c62a228d253e -configuration Debug' in directory '/usr/local/lib/node_modules/appium/node_modules/appium-xcuitest-driver/WebDriverAgent'
[debug] [XCUITest] Output from xcodebuild will not be logged
[debug] [XCUITest] Starting iproxy to forward traffic from local port 8100 to device port 8100 over USB
^C[Appium] Received SIGINT - shutting down
[debug] [XCUITest] iproxy exited with code 'null'
my full log
Manikandan M G
@mgmanikandan87
@Gamaiva do you have webdriveragent already installed
if yes
delete it and run it
Hemanathan
@Gamaiva
Screen Shot 2017-05-11 at 4.32.41 PM.png
you want me to delete this folder
Hemanathan
@Gamaiva
@mgmanikandan87 r u there
Hemanathan
@Gamaiva
stilll I am facing this problem
Aionitoaie Andrei
@yozzz06_twitter
hey guys do you know about some known issue inAppium v1.6.4 , about identifying elements from a pop up?
on ios
Hemanathan
@Gamaiva
guys still I am struck up with WDA isse
issue
can any one help me
Aionitoaie Andrei
@yozzz06_twitter
any ideas how to change network state for iOS in Appium?
Aionitoaie Andrei
@yozzz06_twitter
great apple did it agian
Punita Ojha
@punitaojha
This message was deleted
Aionitoaie Andrei
@yozzz06_twitter
Hemanathan
@Gamaiva
is that possible to use same code of android code for iOS
Vishnu
@vishnu45
Hey ppl, could you suggest me some popular libraries for automated web service testing.
Mykhailo Poliarush
@poliarush
There are a lot of libraries. What are your goals and programming language would you like to use?
did you look at awesome-test-automation ? :)
Vishnu
@vishnu45
I have worked mostly in automation functional testing using Selenium/QTP. But I had never previously automated service testing of SOAP/REST services. I have mostly used postman to validate responses.
Are there custom frameworks like selenium which ppl use to automate service testing?
Mykhailo Poliarush
@poliarush
what programming language are you interested in?
Vishnu
@vishnu45
Java
Vishnu
@vishnu45
thank u @polusok
Vishnu
@vishnu45
Hey guys, when creating automation testing frameworks - web testing, API or any other forms of automated testing - what is the most common file type used to read and store test data? Excel, XML or JSON..?
Say, if I were to be creating an automated functional testing framework using Selenium for an e-com webSite which do you think would be most appropriate to store test data?
Anton Pavlov
@Antonppavlov
Hi! When working with the library "rest-assured" anybody faced with the issue ?
sun.security.validator.ValidatorException: PKIX path building failed: sun.security.provider.certpath.SunCertPathBuilderException: unable to find valid certification path to requested target
Vishnu
@vishnu45
Hey guys, how do we calculate test coverage when performing automated functional testing using tools like Selenium..?
Mykhailo Poliarush
@poliarush
pickup coverage tool for your language and link it to the project during execution, that's all :)
shyamkumarj
@shyamkumarj
Hey Guys, A quick question - Do you guys know of any automation framework that would support the automation of third party apps on mobile (iOS & Android)? For example, open and navigate a visual voice mail app which is a native app from AT&T
Sundeep Joseph Machado
@sjmach
@vishnu45 You need access to source code while running your tests. There is a free plugin called Jacoco that does it.
@vishnu45 : The csv file is an ideal data store. It is simple to use on both Linux and Windows machine and you dont need to use a special software like Office to edit it.
BobFrostMan
@BobFrostMan
Hi guys) Does anybody has an experience with running com.smartbear.soapui from java code? I had and issue, with XPathassertions (they are always failing through java, but successfully passing via soapui interface). Has anybody faced this kind of issue?
Aionitoaie Andrei
@yozzz06_twitter
hey guys. any ideas about how to get some metrics regarding battery consumption on mobile phones?
Muntaz Kaleem
@mkhb654
Hello guys im looking for some really great engineers to help build test automation framework. This is more advance framework with core Java skill set. If interested please email me at qaacademynyc@gmail.com. This will be paid
Mykhailo Poliarush
@poliarush
@mkhb654 write us on http://sdclabs.com if you need some help with test automation framework
Muntaz Kaleem
@mkhb654
sure thing @polusok