These are chat archives for atomix/atomix

27th
Oct 2018
Johno Crawford
@johnou
Oct 27 2018 08:57
[ERROR] Tests run: 2, Failures: 0, Errors: 1, Skipped: 0, Time elapsed: 11.121 s <<< FAILURE! - in io.atomix.core.barrier.DistributedCyclicBarrierTest
[ERROR] testBarrier(io.atomix.core.barrier.DistributedCyclicBarrierTest)  Time elapsed: 10.409 s  <<< ERROR!
java.util.concurrent.TimeoutException
    at io.atomix.core.barrier.DistributedCyclicBarrierTest.testBarrier(DistributedCyclicBarrierTest.java:72)
something funky with this test, seems to fail often