These are chat archives for boostorg/hana

27th
May 2016
Jason Rice
@ricejasonf
May 27 2016 20:50
Scanning dependencies of target test.ext.boost.fusion.tuple.auto.partition
[ 22%] Building CXX object test/CMakeFiles/test.ext.boost.fusion.tuple.auto.partition.dir/ext/boost/fusion/tuple/auto/partition.cpp.o
[ 22%] Linking CXX executable test.ext.boost.fusion.tuple.auto.partition
[ 22%] Built target test.ext.boost.fusion.tuple.auto.partition
Scanning dependencies of target test.issues.github_260
make[3]: *** No rule to make target `../test/issues/github_260.cpp', needed by `test/CMakeFiles/test.issues.github_260.dir/issues/github_260.cpp.o'.  Stop.
make[2]: *** [test/CMakeFiles/test.issues.github_260.dir/all] Error 2
make[1]: *** [CMakeFiles/check.dir/rule] Error 2
make: *** [check] Error 2
just running make check
Jason Rice
@ricejasonf
May 27 2016 21:12
aww.. crap disregard
that was a test from a different branch