Where communities thrive


  • Join over 1.5M+ people
  • Join over 100K+ communities
  • Free without limits
  • Create your own community
People
Repo info
Activity
kuchanamounika
@kuchanamounika
Hi Team,

I am running hygieia executive dashboard by configuring the analysis collector
while running the collector I am getting issue like below
2021-09-06 06:12:21.006 ERROR 31117 --- [taskScheduler-1] o.s.s.s.TaskUtils$LoggingErrorHandler : Unexpected error occurred in scheduled task.
java.lang.NoClassDefFoundError: Lcom/mongodb/MongoDriverInformation;
at java.lang.Class.getDeclaredFields0(Native Method) ~[na:1.8.0_302]
at java.lang.Class.privateGetDeclaredFields(Class.java:2583) ~[na:1.8.0_302]
at java.lang.Class.getDeclaredFields(Class.java:1916) ~[na:1.8.0_302]
at org.apache.spark.util.SizeEstimator$.getClassInfo(SizeEstimator.scala:330) ~[spark-core_2.11-2.3.3.jar!/:2.3.3]
at org.apache.spark.util.SizeEstimator$.visitSingleObject(SizeEstimator.scala:222) ~[spark-core_2.11-2.3.3.jar!/:2.3.3]
at org.apache.spark.util.SizeEstimator$.org$apache$spark$util$SizeEstimator$$estimate(SizeEstimator.scala:201) ~[spark-core_2.11-2.3.3.jar!/:2.3.3]
at org.apache.spark.util.SizeEstimator$.estimate(SizeEstimator.scala:69) ~[spark-core_2.11-2.3.3.jar!/:2.3.3]

Can Some one help on resolving this issue please

kuchanamounika
@kuchanamounika
Hi Team
Is there any way to create dashboards dynamically by providing configuration files
Viresh
@Viresh1994
what error u are facing mention clearly
kuchanamounika
@kuchanamounika

@Viresh1994
I am able to resolve the issue like java.lang.NoClassDefFoundError: Lcom/mongodb/MongoDriverInformation;
by changing the spark version 2.4.3 and mongo spark connector with 2.4.0 version in pom.xml of exec-analysis
after resolving this issue I am getting below below issue while running exec-analysis jar command as
java -jar /opt/ExecDashboard/exec-analysis/target/exec-analysis-1.0.0-SNAPSHOT.jar -Djasypt.encryptor.password=hygieiasecret --spring.config.location=/opt/ExecDashboa
rd/exec-analysis/analysis.properties --server.port=8021

Issue :

2021-09-07 12:18:32.130 ERROR 17865 --- [taskScheduler-1] com.mongodb.spark.rdd.MongoRDD :

WARNING: Partitioning failed.

Partitioning using the 'DefaultMongoPartitioner$' failed.
Please check the stacktrace to determine the cause of the failure or check the Partitioner API documentation.

Note: Not all partitioners are suitable for all toplogies and not all partitioners support views.%n

2021-09-07 12:18:32.131 ERROR 17865 --- [taskScheduler-1] o.s.s.s.TaskUtils$LoggingErrorHandler : Unexpected error occurred in scheduled task.
java.lang.NoSuchMethodError: com.mongodb.client.MongoCollection.countDocuments(Lorg/bson/conversions/Bson;)J
at com.mongodb.spark.rdd.partitioner.MongoSamplePartitioner

KaTeX parse error: Can't use function '$' in math mode at position 8: anonfun$̲7.apply(MongoSa…: anonfun$7.apply(MongoSamplePartitioner.scala:88) ~[mongo-spark-connector_2.11-2.4.0.jar!/:2.4.0]
        at com.mongodb.spark.rdd.partitioner.MongoSamplePartitioner
anonfun$7.apply(MongoSamplePartitioner.scala:88) ~[mongo-spark-connector_2.11-2.4.0.jar!/:2.4.0]
at com.mongodb.spark.MongoConnector
KaTeX parse error: Can't use function '$' in math mode at position 8: anonfun$̲withCollectionD…: anonfun$withCollectionDo$1.apply(MongoConnector.scala:186) ~[mongo-spark-connector_2.11-2.4.0.jar!/:2.4.0]
        at com.mongodb.spark.MongoConnector
anonfun$withCollectionDo$1.apply(MongoConnector.scala:184) ~[mongo-spark-connector_2.11-2.4.0.jar!/:2.4.0]
at com.mongodb.spark.MongoConnector
KaTeX parse error: Can't use function '$' in math mode at position 8: anonfun$̲withDatabaseDo$…: anonfun$withDatabaseDo$1.apply(MongoConnector.scala:171) ~[mongo-spark-connector_2.11-2.4.0.jar!/:2.4.0]
        at com.mongodb.spark.MongoConnector
anonfun$withDatabaseDo$1.apply(MongoConnector.scala:171) ~[mongo-spark-connector_2.11-2.4.0.jar!/:2.4.0]

Can you help in resolving this?

Viresh
@Viresh1994
install Mongodb and then create databse named dashboarddb and then run mongod and mongo then provide database details in Hygieia/api application properties file
kuchanamounika
@kuchanamounika
I did all those @Viresh1994
even though I am getting same issue
Thank you for your response
Viresh
@Viresh1994
You are using windows or linux machine? @kuchanamounika
Kenny Long
@kennethlong
Hygieia is awesome, only problem is it uses MongoDB which has a license that I will never get approved. Anybody done a port to an alternative database?
Viresh
@Viresh1994
Just install MongoDB and then run the database after updating application properties with below details
dbname=dashboarddb
dbusername=dashboarduser
dbpassword=dbpassword
dbhost=localhost
dbport=27017
dbreplicaset=false
dbhostport=localhost:27017
server.contextPath=/api
server.port=8080
kuchanamounika
@kuchanamounika
@Viresh1994 Thank you for your response, i am able resolve the issue by changing the mongo java driver jar in pom.xml of executive dashboard
kuchanamounika
@kuchanamounika

@Viresh1994 I am working on creating the dashboard using RESTAPI
using curl like below by creating API Token
curl --location --request POST 'http://ip:port/api/dashboard/remoteCreate'
--header 'Content-Type: application/json'
--header 'apiUser: apiuser'
--header 'Authorization: apiToken$token'
--data-raw ''''{ "buildEntries": [{ "description": "MTA", "niceName":"Test","options": { "instanceUrl": "", "jobName": "MTA", "jobUrl": "" }, "pushed": false, "toolName": "Hudson" } ], "metaData": { "applicationName": "Test dashboard", "componentName": "Test dashboard", "owner": { "authType": "STANDARD", "username": "admin" }, "template": "splitview", "title": "Test dashboard", "type": "team" } }'''

I am getting issue like below
{
"timestamp": 1632146348562,
"status": 500,
"error": "Internal Server Error",
"exception": "java.lang.StringIndexOutOfBoundsException",
"message": "String index out of range: -1",
"path": "/api/dashboard/remoteCreate"
}

Can you help me on resolve this?
kuchanamounika
@kuchanamounika

Hi Team
I am trying to create the dashboard in Exec dashboard with static code analysis results
while running exec-analysis collector I am getting the issue like below

Analysis Exception thrown for struct field:null
Unexpected error occurred in scheduled task.java.lang.NullPointerException: null at com.capitalone.dashboard.exec.collector.DefaultDataCollector.collectAll(DefaultDataCollector.java:56) ~[classes!/:1.0.0-SNAPSHOT]
my properties file like belo

MongoDB Details

dbname=analyticsdb
dbusername=<user>
dbpassword=**
dbhostport=localhost:27017
logging.file=analysis.log
portfolio.cron=
portfolio.readUriUserName=<user>
portfolio.readUriPassword=**
portfolio.readUriDatabase=localhost:27017/dashboarddb
portfolio.readUriPrefix=mongodb
portfolio.readDatabase=dashboarddb
portfolio.writeUri=mongodb://localhost:27017
portfolio.writeDatabase=analyticsdb
portfolio.filters=scm-commits:item:environment|production-incidents:severity:1.0|

Enable/Disable Static Code Collector

portfolio.staticCodeAnalysisCollectorFlag=true
can some one help me on resolving it?

prasad-clouduser
@prasad-clouduser
Hi Guys, Does any have the details of the recommended configuration to have Hygieia up and running? Also anyone have the official helm charts of installation of hygieia on K8s environment and also recommended configuration?
jitusaklani
@jitusaklani
Need help to generate Hygieia-Jenkins Plugin
Hygieia-Jenkins Plugin: I cloned https://github.com/hygieia/hygieia.git to generate jenkins plugin and executed commands as described in document. But it dosen't create jenkins hygieia-publisher.hpi and the jar
Kenny Long
@kennethlong
@jitusaklani The repo for the Jenkins plugin is: https://github.com/hygieia/hygieia-build-jenkins-collector
@prasad-clouduser The collectors aren't currently written to run in a container. They have no health / heartbeat endpoints for example. I know the CapitalOne team is working on getting things set up for containers and helm chart installation, but in the current version, things are setup to run on a server or some kind. Anywhere you can run Java works, Linux, Mac, Windows... If you want to get a feel for things, the best path is to install it on your local machine. Then the defaults for getting API up and running pretty much just work. You can tweak things for a server environment much easier once you have gone through the exercise of getting things running locally. Getting all the collector properties setup can be a little tricky and it simplifies things if you set things up locally first. Hope that help!
Kenny Long
@kennethlong
When I run the Jira Collector it creates features, teams, and scopes. It doesn't create any AgileTool CollectorItems in the collector_items collection. How do the AgileTool entries get created in collector_items? Are these created manually or should the Jira collector be creating those.
Akshay Sadawarte
@Sadawarteakshay
Hello all, can I connect TeamCity to Hygieia? Has anyone created a collector for it(TeamCity)?
dmitri_cloud
@dmitri_cloud:matrix.org
[m]

hey everyone, I am attempting to connect my AWS Collector to Hygieia. Through logs I can see that UI, API, and AWS Collector are up and running properly. I can even see that the AWS Collector is pulling all instance data correctly. However, I cannot see any way on the UI to set up a cloud widget whether its through choosing the default capone template or just setting up separate widgets. The only separate widget options I see are "Feature, Build, Repo, Codeanalysis, Deploy".

Also, all the guides online and even the github page for setting up cloud widgets seems to have a different, outdated UI. Anyone face similar issues? What were your approaches? All 3 services (UI, API, AWS Collector) are currently running as their own Docker Images. Thanks!

Kalluri Narasimha
@narasimhulu.k:matrix.org
[m]
Hi All
I configured Hygieia dashboard
But i am unable to see repo dropdown list and feture list
Please help me
narasimhacalsoft
@narasimhacalsoft
Please hel me
Masi Nazarian
@masinazarian
Hi everyone, My Jenkins build collector is getting stuck when fetching data for individual jobs and gives "Read Timeout" error. Any suggestions to fix this is much appreciated!
Masi Nazarian
@masinazarian
@erictice Do you mind sharing your config fields for Jenkins build and Jenkins code quality? Also, which UI widget corresponds to Jenkins code quality? Thank you!
testn
@testn
It does not seem to have any movements in the project for a while. Is there a plan to revive this?
Akshay Sadawarte
@Sadawarteakshay
Hello everyone! I wanted to know if the new log4j issue also persists in Hygieia dashboard... Any ways to detect and remove it?
2 replies
Akshay Sadawarte
@Sadawarteakshay
Hello everyone! Has someone successfully made a collector for teamcity and integrated it with hygieia?
Haysam Bin Tahir
@Haysam-Bin-Tahir
Hi, I want to set up SSO in Hygieia. I have set up SAML authentication on Azure. How do I configure Hygieia to use that?
ahmedomairhabib
@ahmedomairhabib
On Hygieia UI why creation of Product dashboard disabled? I downloaded the latest master branch code.
chireddy
@chireddy

I am trying to build the api and UI and trying to access from internet:
Running API:

'''2022-01-11 10:24:16,483 [main] INFO s.d.s.w.r.o.CachingOperationNameGenerator - Generating unique operation named: createGitHubv3UsingPOST_2
2022-01-11 10:24:16,485 [main] INFO s.d.s.w.r.o.CachingOperationNameGenerator - Generating unique operation named: searchUsingGET_3
2022-01-11 10:24:16,506 [main] INFO o.a.coyote.http11.Http11NioProtocol - Starting ProtocolHandler ["http-nio-8080"]
2022-01-11 10:24:16,513 [main] INFO o.a.tomcat.util.net.NioSelectorPool - Using a shared selector for servlet write/read
2022-01-11 10:24:16,529 [main] INFO o.s.b.c.e.t.TomcatEmbeddedServletContainer - Tomcat started on port(s): 8080 (http)
2022-01-11 10:24:16,538 [main] INFO com.capitalone.dashboard.Application - Started Application in 14.121 seconds (JVM running for 15.354)'''

ng serve output:

''' Angular Live Development Server is listening on localhost:4200, open your browser on http://localhost:4200/
ℹ 「wdm」: Compiled successfully.'''

'''[centos@ip- ~]$ curl http://localhost:8080/api/ping
true'''

'''[centos@ip- ~]$ curl http://localhost:4200
<!doctype html>

<html lang="en">

<head>
<meta charset="utf-8">
<title>Hygieia</title>
<base href="/">

<meta name="viewport" content="width=device-width, initial-scale=1">
<link rel="icon" type="image/x-icon" href="favicon.png">
<link href="https://fonts.googleapis.com/css?family=Roboto:300,400,500" rel="stylesheet">
<link href="https://fonts.googleapis.com/icon?family=Material+Icons" rel="stylesheet">
</head>

<body>
<app-root>
<style>@-webkit-keyframes spin{0%{transform:rotate(0)}100%{transform:rotate(360deg)}}@-moz-keyframes spin{0%{-moz-transform:rotate(0)}100%{-moz-transform:rotate(360deg)}}@keyframes spin{0%{transform:rotat(0)}100%{transform:rotate(360deg)}}.spinner{position:fixed;top:0;left:0;width:100%;height:100%;z-index:1003;background: #000000;overflow:hidden} .spinner div:first-child{display:block;position:relative;left:0%;top:50%;width:150px;height:150px;margin:-75px 0 0 -75px;border-radius:50%;box-shadow:0 3px 3px 0 rgba(255,56,106,1);transform:translate3d(0,0,0);animation:spin 2s linear infinite} .spinner div:first-childafter,.spinner div:first-child:before{content:'';position:absolute;border-radius:50%} .spinner div:first-child:before{top:5px;left:5px;right:5px;bottom:5px;box-shadow:0 3px 3px 0 rgb(255, 228, 32);-webkit-anmation:spin 3s linear infinite;animation:spin 3s linear infinite} .spinner div:first-child:after{top:15px;left:15px;right:15px;bottom:15px;box-shadow:0 3px 3px 0 rgba(61, 175, 255,1);animation:spin 1.5s liner infinite}</style>
<div id="nb-global-spinner" class="spinner">
<div class="blob blob-0"></div>
<div class="blob blob-1"></div>
<div class="blob blob-2"></div>
<div class="blob blob-3"></div>
<div class="blob blob-4"></div>
<div class="blob blob-5"></div>
</div>
</app-root>

<script src="runtime.js"></script><script src="polyfills-es5.js" nomodule></script><script src="polyfills.js"></script><script src="styles.js"></script><script src="vendor.js"></script><script src="main.js"><script></body>
</html>'''

When I try to access the application using public_ip:4200, I am seeing the below error:

This site can’t be reached

<IP> refused to connect.
Try:

Checking the connection
Checking the proxy and the firewall
ERR_CONNECTION_REFUSED

When ever I hit the URL, I am seeing below log:
2022-01-11 10:38:09,565 [http-nio-8080-exec-8] INFO c.c.d.a.t.JwtAuthenticationFilter - correlation_id=NULL application=hygieia, service=api, requester=API_USER, duration=24, uri=/api/, request_method=GET, response_code=404, client_ip=14.97.68.10, request_params=NONE

Can any one please help me?
chireddy
@chireddy

When I run the tests using "ng test --watch=false --browsers=ChromeHeadless", I am seeing one error. Could you please help me with this error?

Chrome Headless 97.0.4692.71 (Linux x86_64): Executed 287 of 532 SUCCESS (0 secs / 46.34 secs)
Chrome Headless 97.0.4692.71 (Linux x86_64) DeployConfigFormComponent should create FAILED
Expected 2 to equal 1.
at SafeSubscriber._next (http://localhost:9876/_karma_webpack_/webpack:/src/app/widget_modules/build/build-widget/build-widget.component.spec.ts:364:70)
at SafeSubscriber.push../node_modules/rxjs/_esm5/internal/Subscriber.js.SafeSubscriber.tryOrUnsub (http://localhost:9876/_karma_webpack_/webpack:/node_modules/rxjs/_esm5/internal/Subscriber.js:192:1)
at SafeSubscriber.push../node_modules/rxjs/_esm5/internal/Subscriber.js.SafeSubscriber.next (http://localhost:9876/_karma_webpack_/webpack:/node_modules/rxjs/_esm5/internal/Subscriber.js:130:1)
at Subscriber.push../node_modules/rxjs/_esm5/internal/Subscriber.js.Subscriber._next (http://localhost:9876/_karma_webpack_/webpack:/node_modules/rxjs/_esm5/internal/Subscriber.js:76:1)
Expected 2 to equal 1.
at SafeSubscriber._next (http://localhost:9876/_karma_webpack_/webpack:/src/app/widget_modules/build/build-widget/build-widget.component.spec.ts:365:70)
at SafeSubscriber.push../node_modules/rxjs/_esm5/internal/Subscriber.js.SafeSubscriber.
tryOrUnsub (http://localhost:9876/_karma_webpack_/webpack:/node_modules/rxjs/_esm5/internal/Subscriber.js:192:1)
at SafeSubscriber.push../node_modules/rxjs/_esm5/internal/Subscriber.js.SafeSubscriber.next (http://localhost:9876/_karma_webpack_/webpack:/node_modules/rxjs/_esm5/internal/Subscriber.js:130:1)
at Subscriber.push../node_modules/rxjs/_esm5/internal/Subscriber.js.Subscriber._next (http://localhost:9876/_karma_webpack_/webpack:/node_modules/rxjs/_esm5/internal/Subscriber.js:76:1)
Expected 3 to equal 7.
at SafeSubscriber._next (http://localhost:9876/_karma_webpack_/webpack:/src/app/widget_modules/build/build-widget/build-widget.component.spec.ts:366:72)
at SafeSubscriber.push../node_modules/rxjs/_esm5/internal/Subscriber.js.SafeSubscriber.tryOrUnsub (http://localhost:9876/_karma_webpack_/webpack:/node_modules/rxjs/_esm5/internal/Subscriber.js:192:1)
at SafeSubscriber.push../node_modules/rxjs/_esm5/internal/Subscriber.js.SafeSubscriber.next (http://localhost:9876/_karma_webpack_/webpack:/node_modules/rxjs/_esm5/internal/Subscriber.js:130:1)
at Subscriber.push../node_modules/rxjs/_esm5/internal/Subscriber.js.Subscriber._next (http://localhost:9876/_karma_webpack_/webpack:/node_modules/rxjs/_esm5/internal/Subscriber.js:76:1)
Expected 3 to equal 6.
at SafeSubscriber._next (http://localhost:9876/_karma_webpack_/webpack:/src/app/widget_modules/build/build-widget/build-widget.component.spec.ts:367:72)
at SafeSubscriber.push../node_modules/rxjs/_esm5/internal/Subscriber.js.SafeSubscriber.
tryOrUnsub (http://localhost:9876/_karma_webpack_/webpack:/node_modules/rxjs/_esm5/internal/Subscriber.js:192:1)
at SafeSubscriber.push../node_modules/rxjs/_esm5/internal/Subscriber.js.SafeSubscriber.next (http://localhost:9876/_karma_webpack_/webpack:/node_modules/rxjs/_esm5/internal/Subscriber.js:130:1)
at Subscriber.push../node_modules/rxjs/_esm5/internal/Subscriber.js.Subscriber._next (http://localhost:9876/_karma_webpack_/webpack:/node_modules/rxjs/_esm5/internal/Subscriber.js:76:1)
Chrome Headless 97.0.4692.71 (Linux x86_64): Executed 329 of 532 (1 FAILED) (0 secs / 58.674 secs)
Chrome Headless 97.0.4692.71 (Linux x86_64) DeployConfigFormComponent should create FAILED
Expected 2 to equal 1.
at SafeSubscriber._next (http://localhost:9876/_karma_webpack_/webpack:/src/app/widget_modules/build/build-widget/build-widget.component.spec.ts:364:70)
at SafeSubscriber.push../node_modules/rxjs/_esm5/internal/Subscriber.js.SafeSubscriber.__tryOrUnsub (http://loca

ragi1492
@ragi1492

Hi. Can anyone share the latest gulpfile.js ? I'm getting the below error when running gulp serve.

[12:04:46] Using gulpfile /opt/Hygieia/UI/gulpfile.js
[12:04:46] Starting 'build'...
[12:04:46] Starting 'clean'...
[12:04:46] Finished 'clean' after 41 ms
[12:04:46] Starting 'assets'...
[12:04:46] Starting 'themes'...
[12:04:46] Starting 'fonts'...
[12:04:46] Starting 'js'...
[12:04:46] Starting 'views'...
[12:04:46] Starting 'test-data'...
[12:04:46] Finished 'themes' after 19 ms
[12:04:46] Finished 'fonts' after 16 ms
[12:04:46] Finished 'test-data' after 13 ms
[12:04:46] Finished 'js' after 113 ms
[12:04:47] Finished 'assets' after 176 ms
[12:04:47] Finished 'views' after 327 ms
[12:04:47] Starting 'html'...
[12:04:47] 'html' errored after 150 ms
[12:04:47] Error: must provide pattern
at new GlobSync (/opt/Hygieia/UI/node_modules/glob/sync.js:28:11)
at Function.globSync [as sync] (/opt/Hygieia/UI/node_modules/glob/sync.js:23:10)
at /opt/Hygieia/UI/node_modules/npm-wiredep/lib/detect-dependencies.js:113:14
at Array.reduce (<anonymous>)
at findMainFiles (/opt/Hygieia/UI/node_modules/npm-wiredep/lib/detect-dependencies.js:111:29)
at /opt/Hygieia/UI/node_modules/npm-wiredep/lib/detect-dependencies.js:165:17
at /opt/Hygieia/UI/node_modules/lodash/lodash.js:4967:15
at baseForOwn (/opt/Hygieia/UI/node_modules/lodash/lodash.js:3032:24)
at /opt/Hygieia/UI/node_modules/lodash/lodash.js:4936:18
at Function.forEach (/opt/Hygieia/UI/node_modules/lodash/lodash.js:9410:14)
at detectDependencies (/opt/Hygieia/UI/node_modules/npm-wiredep/lib/detect-dependencies.js:34:7)
at wiredep (/opt/Hygieia/UI/node_modules/npm-wiredep/npm-wiredep.js:69:39)
at Gulp.<anonymous> (/opt/Hygieia/UI/gulpfile.js:263:13)
at module.exports (/opt/Hygieia/UI/node_modules/orchestrator/lib/runTask.js:34:7)
at Gulp.Orchestrator._runTask (/opt/Hygieia/UI/node_modules/orchestrator/index.js:273:3)
at Gulp.Orchestrator._runStep (/opt/Hygieia/UI/node_modules/orchestrator/index.js:214:10)
[12:04:47] 'build' errored after 533 ms
[12:04:47] Error in plugin "run-sequence(html)"
Message:
must provide pattern
Stack:
Error: must provide pattern
at new GlobSync (/opt/Hygieia/UI/node_modules/glob/sync.js:28:11)
at Function.globSync [as sync] (/opt/Hygieia/UI/node_modules/glob/sync.js:23:10)
at /opt/Hygieia/UI/node_modules/npm-wiredep/lib/detect-dependencies.js:113:14
at Array.reduce (<anonymous>)
at findMainFiles (/opt/Hygieia/UI/node_modules/npm-wiredep/lib/detect-dependencies.js:111:29)
at /opt/Hygieia/UI/node_modules/npm-wiredep/lib/detect-dependencies.js:165:17
at /opt/Hygieia/UI/node_modules/lodash/lodash.js:4967:15
at baseForOwn (/opt/Hygieia/UI/node_modules/lodash/lodash.js:3032:24)
at /opt/Hygieia/UI/node_modules/lodash/lodash.js:4936:18
at Function.forEach (/opt/Hygieia/UI/node_modules/lodash/lodash.js:9410:14)
at detectDependencies (/opt/Hygieia/UI/node_modules/npm-wiredep/lib/detect-dependencies.js:34:7)
at wiredep (/opt/Hygieia/UI/node_modules/npm-wiredep/npm-wiredep.js:69:39)
at Gulp.<anonymous> (/opt/Hygieia/UI/gulpfile.js:263:13)
at module.exports (/opt/Hygieia/UI/node_modules/orchestrator/lib/runTask.js:34:7)
at Gulp.Orchestrator._runTask (/opt/Hygieia/UI/node_modules/orchestrator/index.js:273:3)
at Gulp.Orchestrator._runStep (/opt/Hygieia/UI/node_modules/orchestrator/index.js:214:10)

testn
@testn
Is Hygieia still being maintained? It seems to be quite dormant for a while already