These are chat archives for ceylon/ceylon-ide-eclipse

9th
Jan 2017
Gavin King
@gavinking
Jan 09 2017 16:08
@davidfestal I can’t build the Eclipse plugin right now
David Festal
@davidfestal
Jan 09 2017 16:09
I didn't push anything for a while, what is the error exactly ?
and didn't pull either ...
Gavin King
@gavinking
Jan 09 2017 16:09
compilation failures in tests, it seems
David Festal
@davidfestal
Jan 09 2017 16:10
more details or a gist ?
Gavin King
@gavinking
Jan 09 2017 16:10
     [exec] [INFO] ------------------------------------------------------------------------
     [exec] [INFO] BUILD FAILURE
     [exec] [INFO] ------------------------------------------------------------------------
     [exec] [INFO] Total time: 01:55 min
     [exec] [INFO] Finished at: 2017-01-08T13:00:35+01:00
     [exec] [INFO] Final Memory: 189M/2479M
     [exec] [INFO] ------------------------------------------------------------------------
     [exec] [ERROR] Failed to execute goal org.eclipse.tycho:tycho-compiler-plugin:0.24.0:compile (default-compile) on project com.redhat.ceylon.eclipse.ui.test: Compilation failure: Compilation failure:
     [exec] [ERROR] /Users/gavin/ceylon-ide-eclipse/tests/com.redhat.ceylon.eclipse.ui.test/src/com/redhat/ceylon/eclipse/ui/test/headless/JDTModelLoaderTests.java:[38]
     [exec] [ERROR] import com.redhat.ceylon.compiler.java.test.model.ModelLoaderTests;
     [exec] [ERROR] ^^^^^^^^^^^^^^^^^^^^^^^^^^^^^^^^^^^^
     [exec] [ERROR] The import com.redhat.ceylon.compiler.java.test cannot be resolved
     [exec] [ERROR] /Users/gavin/ceylon-ide-eclipse/tests/com.redhat.ceylon.eclipse.ui.test/src/com/redhat/ceylon/eclipse/ui/test/headless/JDTModelLoaderTests.java:[39]
     [exec] [ERROR] import com.redhat.ceylon.compiler.java.test.model.RunnableTest;
     [exec] [ERROR] ^^^^^^^^^^^^^^^^^^^^^^^^^^^^^^^^^^^^
     [exec] [ERROR] The import com.redhat.ceylon.compiler.java.test cannot be resolved
     [exec] [ERROR] /Users/gavin/ceylon-ide-eclipse/tests/com.redhat.ceylon.eclipse.ui.test/src/com/redhat/ceylon/eclipse/ui/test/headless/JDTModelLoaderTests.java:[57]
     [exec] [ERROR] public class JDTModelLoaderTests extends ModelLoaderTests {
     [exec] [ERROR] ^^^^^^^^^^^^^^^^
     [exec] [ERROR] ModelLoaderTests cannot be resolved to a type
     [exec] [ERROR] /Users/gavin/ceylon-ide-eclipse/tests/com.redhat.ceylon.eclipse.ui.test/src/com/redhat/ceylon/eclipse/ui/test/headless/JDTModelLoaderTests.java:[127]
     [exec] [ERROR] protected void verifyCompilerClassLoading(String ceylon, ModelComparison modelCompare) {
     [exec] [ERROR] ^^^^^^^^^^^^^^^
     [exec] [ERROR] ModelComparison cannot be resolved to a type
     [exec] [ERROR] /Users/gavin/ceylon-ide-eclipse/tests/com.redhat.ceylon.eclipse.ui.test/src/com/redhat/ceylon/eclipse/ui/test/headless/JDTModelLoaderTests.java:[137]
     [exec] [ERROR] decls.put(getQualifiedPrefixedName(decl), decl);
     [exec] [ERROR] ^^^^^^^^^^^^^^^^^^^^^^^^
     [exec] [ERROR] The method getQualifiedPrefixedName(Declaration) is undefined for the type JDTModelLoaderTests
     [exec] [ERROR] /Users/gavin/ceylon-ide-eclipse/tests/com.redhat.ceylon.eclipse.ui.test/src/com/redhat/ceylon/eclipse/ui/test/headless/JDTModelLoaderTests.java:[155]
     [exec] [ERROR] protected void verifyCompilerClassLoading(String ceylon) {
     [exec] [ERROR] ^^^^^^^^^^^^^^^^^^^^^^^^^^^^^^^^^^^^^^^^^
     [exec] [ERROR] The method verifyCompilerClassLoading(String) of type JDTModelLoaderTests must override or implement a supertype method
     [exec] [ERROR] /Users/gavin/ceylon-ide-eclipse/tests/com.redhat.ceylon.eclipse.ui.test/src/com/redhat/ceylon/eclipse/ui/test/headless/JDTModelLoaderTests.java:[156]
     [exec] [ERROR] verifyCompilerClassLoading(ceylon, new ModelComparison() {
     [exec] [ERROR] ^^^^^^^^^^^^^^^^^^^^^^^^^^
     [exec] [ERROR] The method verifyCompilerClassLoading(String, ModelComparison) from the type JDTModelLoaderTests refers to the missing type ModelComparison
     [exec] [ERROR] /Users/gavin/ceylon-ide-eclipse/tests/com.redhat.ceylon.eclipse.ui.test/src/com/redhat/ceylon/eclipse/ui/test/headless/JDTModelLoaderTests.java:[156]
     [exec] [ERROR] verifyCompilerClassLoading(ceylon, new ModelComparison() {
     [exec] [ERROR] ^^^^^^^^^^^^^^^
     [exec] [ERROR] ModelComparison cannot be resolved to a type
     [exec] [ERROR] /Users/gavin/ceylon-ide-eclipse/tests/com.redhat.ceylon.eclipse.ui.test/src/com/redhat/ceylon/eclipse/ui/test/headless/JDTModelLoaderTests.java:[158]
David Festal
@davidfestal
Jan 09 2017 16:11
Ah, something changed in the ceylon-compiler model loader tests
:-(