These are chat archives for dropbox/pyston

24th
May 2016
Nathaniel J. Smith
@njsmith
May 24 2016 02:57
putting together a talk about the JIT landscape for the language summit this weekend
does anyone have a "screenshot" of Pyston running numpy's tests?
(I'll put a date on it so that they know it's not up-to-the-minute :-))
Nathaniel J. Smith
@njsmith
May 24 2016 03:04
(and by "screenshot" basically I just mean a paste of the test output including the last few lines with the summary results)
Sun
@Daetalus
May 24 2016 07:10
Hope it can help:
======================================================================
ERROR: test_rmul (test_defchararray.TestOperations)
----------------------------------------------------------------------
Traceback (most recent call last):
  File "/home/sun/pyston/numpy_test_env_pyston_release/site-packages/numpy-1.11.0-py2.7-linux-x86_64.egg/numpy/core/tests/test_defchararray.py", line 642, in test_rmul
    ob * A
TypeError: only integer arrays with one element can be converted to an index

======================================================================
ERROR: test_add_doc (test_function_base.TestAdd_newdoc)
----------------------------------------------------------------------
Traceback (most recent call last):
  File "/home/sun/pyston/numpy_test_env_pyston_release/site-packages/numpy-1.11.0-py2.7-linux-x86_64.egg/numpy/testing/decorators.py", line 147, in skipper_func
    return f(*args, **kwargs)
  File "/home/sun/pyston/numpy_test_env_pyston_release/site-packages/numpy-1.11.0-py2.7-linux-x86_64.egg/numpy/lib/tests/test_function_base.py", line 2818, in test_add_doc
    self.assertEqual(np.core.flatiter.index.__doc__[:len(tgt)], tgt)
AttributeError: 'member_descriptor' object has no attribute '__doc__'

======================================================================
FAIL: test_api.test_array_array
----------------------------------------------------------------------
Traceback (most recent call last):
  File "/home/sun/pyston/numpy_test_env_pyston_release/site-packages/nose/case.py", line 197, in runTest
    self.test(*self.arg)
  File "/home/sun/pyston/numpy_test_env_pyston_release/site-packages/numpy-1.11.0-py2.7-linux-x86_64.egg/numpy/core/tests/test_api.py", line 67, in test_array_array
    assert_(isinstance(builtins, dict))
  File "/home/sun/pyston/numpy_test_env_pyston_release/site-packages/numpy-1.11.0-py2.7-linux-x86_64.egg/numpy/testing/utils.py", line 71, in assert_
    raise AssertionError(smsg)
AssertionError

----------------------------------------------------------------------
Ran 6139 tests in 102.170s

FAILED (KNOWNFAIL=6, SKIP=13, errors=2, failures=1)
It include @undingen 's #1205 and #1207, but not include @kmod 's #1209. maybe the second issue will get fixed by #1209.
Kevin Modzelewski
@kmod
May 24 2016 16:59
hey all, fyi it looks like we're pushing back the release by a day
Sun
@Daetalus
May 24 2016 17:00
Great!
Nathaniel J. Smith
@njsmith
May 24 2016 19:00
@sun: Thanks!
uh, doh. @Daetalus: thanks! (and sorry @sun for randomly pinging you, whoever you are)