by

Where communities thrive


  • Join over 1.5M+ people
  • Join over 100K+ communities
  • Free without limits
  • Create your own community
People
Activity
  • 14:35

    norbusan on dev-dist

    status of susi_server_binary_la… (compare)

  • 14:27

    norbusan on development

    fix desktop scripts (compare)

  • Jul 30 13:57
    gaushikmr closed #1473
  • Jul 30 12:56
    norbusan commented #1473
  • Jul 30 05:37
    codecov[bot] commented #1473
  • Jul 30 05:34
    codecov[bot] commented #1473
  • Jul 30 05:32
    gaushikmr opened #1473
  • Jul 22 07:23
    bisham65 commented #1452
  • Jul 19 03:22
    prsk4u commented #1402
  • Jul 19 03:21
    prsk4u commented #1452
  • Jul 18 10:05

    Orbiter on dev-dist

    wqadded ssi (compare)

  • Jul 14 05:44
    BLasan commented #1472
  • Jul 13 19:10

    Orbiter on dev-dist

    wqadded ssi (compare)

  • Jul 13 02:58

    norbusan on development

    add icon specification to deskt… (compare)

  • Jul 12 15:07

    Orbiter on dev-dist

    wqadded ssi (compare)

  • Jul 12 10:17

    Orbiter on dev-dist

    wqadded ssi (compare)

  • Jul 09 03:02

    norbusan on dev-dist

    wqadded ssi (compare)

  • Jul 04 23:05
    jaymeanchante opened #1472
  • Jun 28 09:52

    Orbiter on dev-dist

    wqadded ssi (compare)

  • Jun 27 10:38

    Orbiter on development

    fixed youtube search the youtub… (compare)

Rishabh Bhambani
@rishabhgit0608
@atm1504 app
Anton W. Haubner
@ahbnr
hi, I'd like to try out susi on my own server, but compiling the default branch (development) results in a failed test. What branch is considered "stable"? I'm trying master next
...ok so master fails with a missing dependency (de.schildbach.pte)
Anton W. Haubner
@ahbnr
ok seems there has already been an issue created for this (fossasia/susi_server#1429)
aryanguls
@aryanguls
fossasia/susi.ai#3312 Mentors please review as soon as possible.
aryanguls
@aryanguls
fossasia/susi.ai#3320 Mentors please review this also.
Siddharth Sinha
@Sid911
I am trying to get susi_server up and running on hetzner with autodeployment
> Task :compileJava FAILED
/home/susi_server/src/api/external/transit/JSONConverter.java:8: error: package de.schildbach.pte.dto does not exist
import de.schildbach.pte.dto.Fare;
                            ^
/home/susi_server/src/api/external/transit/JSONConverter.java:9: error: package de.schildbach.pte.dto does not exist
import de.schildbach.pte.dto.Location;
                            ^
/home/susi_server/src/api/external/transit/JSONConverter.java:10: error: package de.schildbach.pte.dto does not exist
import de.schildbach.pte.dto.Trip;
                            ^
/home/susi_server/src/api/external/transit/JSONConverter.java:11: error: package de.schildbach.pte.dto.Trip does not exist
import de.schildbach.pte.dto.Trip.Leg;
                                 ^
/home/susi_server/src/api/external/transit/JSONConverter.java:12: error: package de.schildbach.pte.dto does not exist
import de.schildbach.pte.dto.Line;
                            ^
/home/susi_server/src/api/external/transit/JSONConverter.java:15: error: cannot find symbol
        public static JSONObject tripToJSON(Trip trip) {
                                            ^
  symbol:   class Trip
  location: class JSONConverter
/home/susi_server/src/api/external/transit/JSONConverter.java:36: error: cannot find symbol
        public static JSONObject fareToJson(Fare fare) {
                                            ^
  symbol:   class Fare
  location: class JSONConverter
/home/susi_server/src/api/external/transit/JSONConverter.java:48: error: cannot find symbol
        public static JSONObject legToJSON(Leg leg) {
                                           ^
  symbol:   class Leg
  location: class JSONConverter
/home/susi_server/src/api/external/transit/JSONConverter.java:68: error: cannot find symbol
        public static JSONObject lineToJSON(Line line) {
                                            ^
  symbol:   class Line
  location: class JSONConverter
/home/susi_server/src/api/external/transit/JSONConverter.java:80: error: cannot find symbol
        public static JSONObject locationToJSON(Location location) {
                                                ^
  symbol:   class Location
  location: class JSONConverter
/home/susi_server/src/api/external/transit/JSONConverter.java:94: error: cannot find symbol
        public static String getDescription(List<Leg> legs) {
                                                 ^
  symbol:   class Leg
  location: class JSONConverter
/home/susi_server/src/api/external/transit/BahnService.java:10: error: package de.schildbach.pte does not exist
import de.schildbach.pte.*;
^
/home/susi_server/src/api/external/transit/BahnService.java:11: error: package de.schildbach.pte.dto does not exist
import de.schildbach.pte.dto.Location;
                            ^
/home/susi_server/src/api/external/transit/BahnService.java:12: error: package de.schildbach.pte.dto does not exist
import de.schildbach.pte.dto.QueryTripsResult;
                            ^
/home/susi_server/src/api/external/transit/BahnService.java:13: error: package de.schildbach.pte.dto does not exist
import de.schildbach.pte.dto.Trip;
                            ^
/home/susi_server/src/api/external/transit/BahnService.java:22: error: cannot find symbol
        private BahnProvider provider = new BahnProvider();
                ^
  symbol:   class BahnProvider
  location: class BahnService
16 errors
this is the issue I am facing...
I have made sure that I have install java-headless and java-commons, gradle
I had the same issue with development branch .. this is master
This is a remote hetzner server.. which I have ssh'ed into
Siddharth Sinha
@Sid911
can someone help ? 😅
aryanguls
@aryanguls
fossasia/susi.ai#3341 Mentors please.
Pranav Karthik
@pranavkarthik10
Michael Christen
@Orbiter
@Sid911 did you try the development branch?
Siddharth Sinha
@Sid911
@Orbiter I did at that time but for development branch git submodules does nothing when the command is executed
now there was a different issue.. please wait a sec
Michael Christen
@Orbiter
I removed the submodule! No more submodules!
Siddharth Sinha
@Sid911
@Orbiter got it... can you please wait for a few more mins.. I am starting up the hetzner server and sshing into it
root@sid:/home# cd susi_server
root@sid:/home/susi_server# ./gradlew build
Starting a Gradle Daemon, 1 incompatible and 1 stopped Daemons could not be reused, use --status for details

> Task :test

ai.susi.mind.SusiTutorialTest > test FAILED
    java.lang.AssertionError at SusiTutorialTest.java:44

29 tests completed, 1 failed

> Task :test FAILED

FAILURE: Build failed with an exception.

* What went wrong:
Execution failed for task ':test'.
> There were failing tests. See the report at: file:///home/susi_server/build/reports/tests/test/index.html

* Try:
Run with --stacktrace option to get the stack trace. Run with --info or --debug option to get more log output. Run with --scan to get full insights.

* Get more help at https://help.gradle.org

BUILD FAILED in 46s
12 actionable tasks: 8 executed, 4 up-to-date
aryanguls
@aryanguls
https://codein.withgoogle.com/dashboard/task-instances/6041341025320960/ Please review as soon as possible. @norbusan @orbiter @cweitat Mentors please review.
Mario Behling
@mariobehling

@Orbiter

I removed the submodule! No more submodules!

Cool!

aryanguls
@aryanguls
Nishith P
@NishithP2004
This message was deleted
Siddharth Sinha
@Sid911
@NishithP2004 I think he said that before mario sir said something
aryanguls
@aryanguls
Yep i had sent it before that.
Must have forgotten to delete it
Michael Christen
@Orbiter
@Sid911 does ./gradlew assemble work?
Siddharth Sinha
@Sid911
@Orbiter I think it does.. let me check
checking
image.png
it does work @Orbiter
let me just give the versions of java and gradle that I am using
Gradle 6.0.1
root@sid:/home/susi_server# java --version
openjdk 11.0.5 2019-10-15
OpenJDK Runtime Environment (build 11.0.5+10-post-Ubuntu-0ubuntu1.118.04)
OpenJDK 64-Bit Server VM (build 11.0.5+10-post-Ubuntu-0ubuntu1.118.04, mixed mode, sharing)
aryanguls
@aryanguls
fossasia/susi.ai#3341 Someone please review this and accept this merge request.
Michael Christen
@Orbiter
cool
EdwardCullen30
@EdwardCullen30
is this project up for gsoc 2020 ?
Norbert Preining
@norbusan
GSoC projects are not decided by now, but we hope so.
A.Dilshaad
@Dilshaad21
@norbusan @Orbiter @akshatnitd please review the changes fossasia/susi_server#1451
A.Dilshaad
@Dilshaad21
@Orbiter please review fossasia/susi_server#1456
Michael Christen
@Orbiter
@Dilshaad21 done
A.Dilshaad
@Dilshaad21
Great! Now users will have access to delete their skills after merging fossasia/susi.ai#3462 in the webclient
Muhammad Wasif
@MuhammadWasif
Wow.....That's really great 👍
Michael Christen
@Orbiter
Yeah maybe that reduces the number of bad skills. People are testing skills and are not able to remove their tests afterwards.
A.Dilshaad
@Dilshaad21
:+1:
A.Dilshaad
@Dilshaad21
@Orbiter there has been an issue in storing user's bots as drafts fossasia/susi_server#1457. It kept giving server error
object parser error: Unterminated string at 313 [character 314 line 1]