Where communities thrive


  • Join over 1.5M+ people
  • Join over 100K+ communities
  • Free without limits
  • Create your own community
People
Activity
    Kris Stern
    @krisstern:matrix.org
    [m]
    I think the only thing you will need to change is the Jenkins version
    NehaMittal3010
    @NehaMittal3010
    @krisstern:matrix.org sorry i am not able to see where u have copied and pasted the file
    Kris Stern
    @krisstern:matrix.org
    [m]
    Do you see my message from 16 minutes passed the hour?
    NehaMittal3010
    @NehaMittal3010
    no
    Kris Stern
    @krisstern:matrix.org
    [m]
    Do you see the code below the line "This one" just now?
    NehaMittal3010
    @NehaMittal3010
    i see only :- **Do you see the code below the line "This one" just now?*
    Kris Stern
    @krisstern:matrix.org
    [m]
    Hang on
    NehaMittal3010
    @NehaMittal3010
    yes i got it
    Kris Stern
    @krisstern:matrix.org
    [m]
    I have just uploaded the file
    Okay, cool
    NehaMittal3010
    @NehaMittal3010
    Thank you so much i am using same and trying to build it
    Kris Stern
    @krisstern:matrix.org
    [m]
    Welcome, hopefully it works to some extent like it did no my machine. I built it with the command
    mvn hpi:run
    NehaMittal3010
    @NehaMittal3010
    @krisstern:matrix.org i am running below commands: 1. mvn verify 2. mvn hpi:run 3. target folder will be created and then i will copy the hpi file to jenkins server at plugins folder path.. i hope i am doing correct
    Kris Stern
    @krisstern:matrix.org
    [m]
    Yup, that's similar to what I used
    NehaMittal3010
    @NehaMittal3010
    i got ERROR:-
    [WARNING] Rule 0: org.apache.maven.plugins.enforcer.RequireMavenVersion failed with message:
    3.8.1 required to no longer download dependencies via HTTP (use HTTPS instead).
    [INFO] ------------------------------------------------------------------------
    [INFO] BUILD FAILURE
    [INFO] ------------------------------------------------------------------------
    [INFO] Total time: 02:01 min
    [INFO] Finished at: 2022-02-01T16:57:11Z
    [INFO] Final Memory: 28M/100M
    [INFO] ------------------------------------------------------------------------
    [ERROR] Failed to execute goal org.apache.maven.plugins:maven-enforcer-plugin:3.0.0:enforce (display-info) on project uno-choice: Some Enforcer rules have failed. Look above for specific messages explaining why the rule failed. -> [Help 1]
    [ERROR]
    [ERROR] To see the full stack trace of the errors, re-run Maven with the -e switch.
    [ERROR] Re-run Maven using the -X switch to enable full debug logging.
    [ERROR]
    [ERROR] For more information about the errors and possible solutions, please read the following articles:
    [ERROR] [Help 1] http://cwiki.apache.org/confluence/display/MAVEN/MojoExecutionException
    Kris Stern
    @krisstern:matrix.org
    [m]
    Wait...
    Did you upgrade Maven to version 3.8.4?
    NehaMittal3010
    @NehaMittal3010
    Apache Maven 3.5.2 (138edd61fd100ec658bfa2d307c43b76940a5d7d; 2017-10-18T07:58:13Z)
    Kris Stern
    @krisstern:matrix.org
    [m]
    Oh, better upgrade... Do you know how?
    NehaMittal3010
    @NehaMittal3010
    no
    Kris Stern
    @krisstern:matrix.org
    [m]
    Your version was from 2017...
    What OS are you on?
    NehaMittal3010
    @NehaMittal3010
    i generally do dnf update
    oracle linux
    NAME="Oracle Linux Server"
    VERSION="7.5"
    Kris Stern
    @krisstern:matrix.org
    [m]
    Try downloading first from here: https://maven.apache.org/download.cgi
    NehaMittal3010
    @NehaMittal3010
    ok sure
    Kris Stern
    @krisstern:matrix.org
    [m]
    Then install like this: https://maven.apache.org/install.html
    Kris Stern
    @krisstern:matrix.org
    [m]
    And @NehaMittal3010 I don't think I used Step 3: "...target folder will be created and then i will copy the hpi file to jenkins server at plugins folder path". All I did was replacing the pom.xml file, and then run mvn hpi:run.
    NehaMittal3010
    @NehaMittal3010
    Apache Maven 3.8.4 (9b656c72d54e5bacbed989b64718c159fe39b537)
    ok i am doing only mvn hpi:run
    Kris Stern
    @krisstern:matrix.org
    [m]
    Okay
    NehaMittal3010
    @NehaMittal3010

    [INFO] Using 'UTF-8' encoding to copy filtered resources.
    [INFO] Using 'UTF-8' encoding to copy filtered properties files.
    [INFO] Copying 20 resources
    [INFO]
    [INFO] --- maven-compiler-plugin:3.8.1:compile (default-compile) @ uno-choice ---
    [INFO] Changes detected - recompiling the module!
    [INFO] Compiling 19 source files to /root/final/active-choices-plugin/target/classes
    [INFO] ------------------------------------------------------------------------
    [INFO] BUILD FAILURE
    [INFO] ------------------------------------------------------------------------
    [INFO] Total time: 25.082 s
    [INFO] Finished at: 2022-02-01T17:18:48Z

    [INFO] ------------------------------------------------------------------------

    constituent[0]: file:/root/apache-maven-3.8.4/conf/logging/
    constituent[1]: file:/root/apache-maven-3.8.4/lib/jcl-over-slf4j-1.7.32.jar
    constituent[2]: file:/root/apache-maven-3.8.4/lib/plexus-interpolation-1.26.jar
    constituent[3]: file:/root/apache-maven-3.8.4/lib/org.eclipse.sisu.plexus-0.3.5.jar
    constituent[4]: file:/root/apache-maven-3.8.4/lib/maven-plugin-api-3.8.4.jar
    constituent[5]: file:/root/apache-maven-3.8.4/lib/maven-resolver-api-1.6.3.jar
    constituent[6]: file:/root/apache-maven-3.8.4/lib/plexus-sec-dispatcher-2.0.jar
    constituent[7]: file:/root/apache-maven-3.8.4/lib/plexus-cipher-2.0.jar
    constituent[8]: file:/root/apache-maven-3.8.4/lib/maven-model-builder-3.8.4.jar
    constituent[9]: file:/root/apache-maven-3.8.4/lib/maven-resolver-impl-1.6.3.jar
    constituent[10]: file:/root/apache-maven-3.8.4/lib/maven-settings-3.8.4.jar
    constituent[11]: file:/root/apache-maven-3.8.4/lib/guice-4.2.2-no_aop.jar
    constituent[12]: file:/root/apache-maven-3.8.4/lib/maven-repository-metadata-3.8.4.jar
    constituent[13]: file:/root/apache-maven-3.8.4/lib/maven-model-3.8.4.jar
    constituent[14]: file:/root/apache-maven-3.8.4/lib/plexus-component-annotations-2.1.0.jar
    constituent[15]: file:/root/apache-maven-3.8.4/lib/org.eclipse.sisu.inject-0.3.5.jar
    constituent[16]: file:/root/apache-maven-3.8.4/lib/maven-shared-utils-3.3.4.jar
    constituent[17]: file:/root/apache-maven-3.8.4/lib/maven-compat-3.8.4.jar
    constituent[18]: file:/root/apache-maven-3.8.4/lib/commons-cli-1.4.jar
    constituent[19]: file:/root/apache-maven-3.8.4/lib/guava-25.1-android.jar
    constituent[20]: file:/root/apache-maven-3.8.4/lib/wagon-http-3.4.3-shaded.jar
    constituent[21]: file:/root/apache-maven-3.8.4/lib/commons-io-2.6.jar
    constituent[22]: file:/root/apache-maven-3.8.4/lib/slf4j-api-1.7.32.jar
    constituent[23]: file:/root/apache-maven-3.8.4/lib/maven-artifact-3.8.4.jar
    constituent[24]: file:/root/apache-maven-3.8.4/lib/maven-resolver-connector-basic-1.6.3.jar
    constituent[25]: file:/root/apache-maven-3.8.4/lib/maven-builder-support-3.8.4.jar
    constituent[26]: file:/root/apache-maven-3.8.4/lib/maven-slf4j-provider-3.8.4.jar
    constituent[27]: file:/root/apache-maven-3.8.4/lib/plexus-utils-3.3.0.jar
    constituent[28]: file:/root/apache-maven-3.8.4/lib/maven-embedder-3.8.4.jar
    constituent[29]: file:/root/apache-maven-3.8.4/lib/maven-resolver-provider-3.8.4.jar
    constituent[30]: file:/root/apache-maven-3.8.4/lib/wagon-provider-api-3.4.3.jar
    constituent[31]: file:/root/apache-maven-3.8.4/lib/javax.inject-1.jar
    constituent[32]: file:/root/apache-maven-3.8.4/lib/jansi-2.4.0.jar
    constituent[33]: file:/root/apache-maven-3.8.4/lib/maven-resolver-spi-1.6.3.jar
    constituent[34]: file:/root/apache-maven-3.8.4/lib/maven-resolver-util-1.6.3.jar
    constituent[35]: file:/root/apache-maven-3.8.4/lib/wagon-file-3.4.3.jar
    constituent[36]: file:/root/apache-maven-3.8.4/lib/maven-resolver-transport-wagon-1.6.3.jar
    constituent[37]: file:/root/apache-maven-3.8.4/lib/maven-core-3.8.4.jar
    constituent[38]: file:/root/apache-maven-3.8.4/lib/javax.annotation-api-1.2.jar
    constituent[39]: file:/root/apache-maven-3.8.4/lib/commons-lang3-3.8.1.jar

    constituent[40]: file:/root/apache-maven-3.8.4/lib/maven-settings-builder-3.8.4.jar

    Exception in thread "main" java.lang.AssertionError
    at jdk.compiler/com.sun.tools.javac.ut

    Kris Stern
    @krisstern:matrix.org
    [m]
    Try mvn clean
    NehaMittal3010
    @NehaMittal3010
    ok
    mvn -v
    Apache Maven 3.8.4 (9b656c72d54e5bacbed989b64718c159fe39b537)
    Maven home: /root/apache-maven-3.8.4
    Java version: 11.0.14, vendor: Oracle Corporation, runtime: /usr/java/jdk-11.0.14
    Default locale: en_US, platform encoding: ANSI_X3.4-1968
    OS name: "linux", version: "4.1.12-112.16.4.el7uek.x86_64", arch: "amd64", family: "unix"
    [root@nehabackup active-choices-plugin]# mvn clean
    [WARNING]
    [WARNING] Some problems were encountered while building the effective settings
    [WARNING] 'proxies.proxy.id' must be unique but found duplicate proxy with id default @ /root/.m2/settings.xml
    [WARNING]
    [INFO] Scanning for projects...
    [WARNING] The artifact xml-apis:xml-apis:jar:2.0.2 has been relocated to xml-apis:xml-apis:jar:1.0.b2
    [WARNING] The POM for org.jenkins-ci.tools:maven-hpi-plugin:jar:3.22 is missing, no dependency information available
    [WARNING] Failed to build parent project for org.biouno:uno-choice:hpi:2.5.8-SNAPSHOT
    [INFO]
    [INFO] -----------------------< org.biouno:uno-choice >------------------------
    [INFO] Building Active Choices Plug-in 2.5.8-SNAPSHOT
    [INFO] --------------------------------[ hpi ]---------------------------------
    [INFO]
    [INFO] --- maven-clean-plugin:3.1.0:clean (default-clean) @ uno-choice ---
    [INFO] ------------------------------------------------------------------------
    [INFO] BUILD SUCCESS
    [INFO] ------------------------------------------------------------------------
    [INFO] Total time: 1.361 s
    [INFO] Finished at: 2022-02-01T17:20:41Z
    [INFO] ------------------------------------------------------------------------
    [root]# mvn clean verify
    [WARNING]
    [WARNING] Some problems were encountered while building the effective settings
    [WARNING] 'proxies.proxy.id' must be unique but found duplicate proxy with id default @ /root/.m2/settings.xml
    [WARNING]
    [INFO] Scanning for projects...
    [WARNING] The artifact xml-apis:xml-apis:jar:2.0.2 has been relocated to xml-apis:xml-apis:jar:1.0.b2
    [WARNING] The POM for org.jenkins-ci.tools:maven-hpi-plugin:jar:3.22 is missing, no dependency information available
    [WARNING] Failed to build parent project for org.biouno:uno-choice:hpi:2.5.8-SNAPSHOT
    [INFO]
    [INFO] -----------------------< org.biouno:uno-choice >------------------------
    [INFO] Building Active Choices Plug-in 2.5.8-SNAPSHOT
    [INFO] --------------------------------[ hpi ]---------------------------------
    [WARNING] The artifact xerces:xerces:jar:2.2.1 has been relocated to xerces:xercesImpl:jar:2.2.1
    [INFO]
    [INFO] --- maven-clean-plugin:3.1.0:clean (default-clean) @ uno-choice ---
    [INFO]
    [INFO] --- maven-hpi-plugin:3.22:validate (default-validate) @ uno-choice ---
    [INFO]
    [INFO] --- maven-hpi-plugin:3.22:validate-hpi (default-validate-hpi) @ uno-choice ---
    [INFO]
    [INFO] --- maven-enforcer-plugin:3.0.0:display-info (display-info) @ uno-choice ---
    [INFO] Maven Version: 3.8.4
    [INFO] JDK Version: 11.0.14 normalized as: 11.0.14
    [INFO] Java Vendor: Oracle Corporation
    [INFO] OS Info: Arch: amd64 Family: unix Name: linux Version: 4.1.12-112.16.4.el7uek.x86_64
    [INFO]
    [INFO] --- maven-enforcer-plugin:3.0.0:enforce (display-info) @ uno-choice ---
    [INFO] Ignoring requireUpperBoundDeps in javax.servlet:servlet-api
    [INFO]
    [INFO] --- maven-enforcer-plugin:3.0.0:enforce (no-snapshots-in-release) @ uno-choice ---
    [INFO]
    [INFO] --- gmavenplus-plugin:1.13.1:addTestSources (test-in-groovy) @ uno-choice ---
    [INFO]
    [INFO] --- localizer-maven-plugin:1.31:generate (default) @ uno-choice ---
    [INFO]
    [INFO] --- maven-resources-plugin:3.2.0:resources (default-resources) @ uno-choice ---
    [INFO] Using 'UTF-8' encoding to copy filtered resources.
    [INFO] Using 'UTF-8' encoding to copy filtered properties files.
    [INFO] Copying 20 resources
    [INFO]
    [INFO] --- maven-compiler-plugin:3.8.1:compile (default-compile) @ uno-choice ---
    [INFO] Changes detected - recompiling the module!
    [INFO] Compiling 19 source files to /root/final/active-choices-plugin/target/classes
    [INFO] ------------------------------------------------------------------------
    [INFO] BUILD FAILURE
    [INFO] ----------------------------
    Kris Stern
    @krisstern:matrix.org
    [m]
    Where are you at when you run mvn hpi:run?
    NehaMittal3010
    @NehaMittal3010
    total 72K
    -rw-r--r--. 1 root root 80 Feb 1 13:10 NOTICE.txt
    -rw-r--r--. 1 root root 1.1K Feb 1 13:10 LICENSE.txt
    -rw-r--r--. 1 root root 51 Feb 1 13:10 Jenkinsfile
    drwxr-xr-x. 5 root root 4.0K Feb 1 13:10 src
    drwxr-xr-x. 3 root root 4.0K Feb 1 13:10 docs
    -rw-r--r--. 1 root root 40K Feb 1 13:10 README.md
    -rw-r--r--. 1 root root 7.3K Feb 1 16:54 pom.xml
    drwxr-xr-x. 5 root root 4.0K Feb 1 17:20 target
    at this path i run mvn hpi:run
    Kris Stern
    @krisstern:matrix.org
    [m]
    Oh, no worries, no need to do mvn clean verify
    NehaMittal3010
    @NehaMittal3010

    [root@nehabackup active-choices-plugin]# mvn clean verify
    [WARNING]
    [WARNING] Some problems were encountered while building the effective settings
    [WARNING] 'proxies.proxy.id' must be unique but found duplicate proxy with id default @ /root/.m2/settings.xml
    [WARNING]
    [INFO] Scanning for projects...
    [WARNING] The artifact xml-apis:xml-apis:jar:2.0.2 has been relocated to xml-apis:xml-apis:jar:1.0.b2
    [WARNING] The POM for org.jenkins-ci.tools:maven-hpi-plugin:jar:3.22 is missing, no dependency information available
    [WARNING] Failed to build parent project for org.biouno:uno-choice:hpi:2.5.8-SNAPSHOT
    [INFO]
    [INFO] -----------------------< org.biouno:uno-choice >------------------------
    [INFO] Building Active Choices Plug-in 2.5.8-SNAPSHOT
    [INFO] --------------------------------[ hpi ]---------------------------------
    [WARNING] The artifact xerces:xerces:jar:2.2.1 has been relocated to xerces:xercesImpl:jar:2.2.1
    [INFO]
    [INFO] --- maven-clean-plugin:3.1.0:clean (default-clean) @ uno-choice ---
    [INFO] Deleting /root/final/active-choices-plugin/target
    [INFO]
    [INFO] --- maven-hpi-plugin:3.22:validate (default-validate) @ uno-choice ---
    [INFO]
    [INFO] --- maven-hpi-plugin:3.22:validate-hpi (default-validate-hpi) @ uno-choice ---
    [INFO]
    [INFO] --- maven-enforcer-plugin:3.0.0:display-info (display-info) @ uno-choice ---
    [INFO] Maven Version: 3.8.4
    [INFO] JDK Version: 11.0.14 normalized as: 11.0.14
    [INFO] Java Vendor: Oracle Corporation
    [INFO] OS Info: Arch: amd64 Family: unix Name: linux Version: 4.1.12-112.16.4.el7uek.x86_64
    [INFO]
    [INFO] --- maven-enforcer-plugin:3.0.0:enforce (display-info) @ uno-choice ---
    [INFO] Ignoring requireUpperBoundDeps in javax.servlet:servlet-api
    [INFO]
    [INFO] --- maven-enforcer-plugin:3.0.0:enforce (no-snapshots-in-release) @ uno-choice ---
    [INFO]
    [INFO] --- gmavenplus-plugin:1.13.1:addTestSources (test-in-groovy) @ uno-choice ---
    [INFO]
    [INFO] --- localizer-maven-plugin:1.31:generate (default) @ uno-choice ---
    [INFO]
    [INFO] --- maven-resources-plugin:3.2.0:resources (default-resources) @ uno-choice ---
    [INFO] Using 'UTF-8' encoding to copy filtered resources.
    [INFO] Using 'UTF-8' encoding to copy filtered properties files.
    [INFO] Copying 20 resources
    [INFO]
    [INFO] --- maven-compiler-plugin:3.8.1:compile (default-compile) @ uno-choice ---
    [INFO] Changes detected - recompiling the module!
    [INFO] Compiling 19 source files to /root/final/active-choices-plugin/target/classes
    [INFO] ------------------------------------------------------------------------
    [INFO] BUILD FAILURE
    [INFO] ------------------------------------------------------------------------
    [INFO] Total time: 4.683 s
    [INFO] Finished at: 2022-02-01T17:23:54Z

    [INFO] ------------------------------------------------------------------------

    constituent[0]: file:/root/apache-maven-3.8.4/conf/logging/
    constituent[1]: file:/root/apache-maven-3.8.4/lib/jcl-over-slf4j-1.7.32.jar
    constituent[2]: file:/root/apache-maven-3.8.4/lib/plexus-interpolation-1.26.jar
    constituent[3]: file:/root/apache-maven-3.8.4/lib/org.eclipse.sisu.plexus-0.3.5.jar
    constituent[4]: file:/root/apache-maven-3.8.4/lib/maven-plugin-api-3.8.4.jar
    constituent[5]: file:/root/apache-maven-3.8.4/lib/maven-resolver-api-1.6.3.jar
    constituent[6]: file:/root/apache-maven-3.8.4/lib/plexus-sec-dispatcher-2.0.jar
    constituent[7]: file:/root/apache-maven-3.8.4/lib/plexus-cipher-2.0.jar
    constituent[8]: file:/root/apache-maven-3.8.4/lib/maven-model-builder-3.8.4.jar
    constituent[9]: file:/root/apache-maven-3.8.4/lib/maven-resolver-impl-1.6.3.jar
    constituent[10]: file:/root/apache-maven-3.8.4/lib/maven-settings-3.8.4.jar
    constituent[11]: file:/root/apache-maven-3.8.4/lib/guice-4.2.2-no_aop.jar
    constituent[12]: file:/root/apache-maven-3.8.4/lib/maven-repository-metadata-3.8.4.jar
    constituent[13]: file:/root/apache-maven-3.8.4/lib/maven-model-3.8.4.jar
    constituent[14]: file:/root/apache-maven-3.8.4/lib/plexus-component-annotations-2.1.0.jar
    constituent[15]: file:/root/apache-maven-3.8.4/lib/org.eclipse.sisu.inject-0.3.5.jar
    constituent[16

    Kris Stern
    @krisstern:matrix.org
    [m]
    Just try mvn verify
    What does it tell you now?
    NehaMittal3010
    @NehaMittal3010

    [root@nehabackup active-choices-plugin]# mvn verify
    [WARNING]
    [WARNING] Some problems were encountered while building the effective settings
    [WARNING] 'proxies.proxy.id' must be unique but found duplicate proxy with id default @ /root/.m2/settings.xml
    [WARNING]
    [INFO] Scanning for projects...
    [WARNING] The artifact xml-apis:xml-apis:jar:2.0.2 has been relocated to xml-apis:xml-apis:jar:1.0.b2
    [WARNING] The POM for org.jenkins-ci.tools:maven-hpi-plugin:jar:3.22 is missing, no dependency information available
    [WARNING] Failed to build parent project for org.biouno:uno-choice:hpi:2.5.8-SNAPSHOT
    [INFO]
    [INFO] -----------------------< org.biouno:uno-choice >------------------------
    [INFO] Building Active Choices Plug-in 2.5.8-SNAPSHOT
    [INFO] --------------------------------[ hpi ]---------------------------------
    [WARNING] The artifact xerces:xerces:jar:2.2.1 has been relocated to xerces:xercesImpl:jar:2.2.1
    [INFO]
    [INFO] --- maven-hpi-plugin:3.22:validate (default-validate) @ uno-choice ---
    [INFO]
    [INFO] --- maven-hpi-plugin:3.22:validate-hpi (default-validate-hpi) @ uno-choice ---
    [INFO]
    [INFO] --- maven-enforcer-plugin:3.0.0:display-info (display-info) @ uno-choice ---
    [INFO] Maven Version: 3.8.4
    [INFO] JDK Version: 11.0.14 normalized as: 11.0.14
    [INFO] Java Vendor: Oracle Corporation
    [INFO] OS Info: Arch: amd64 Family: unix Name: linux Version: 4.1.12-112.16.4.el7uek.x86_64
    [INFO]
    [INFO] --- maven-enforcer-plugin:3.0.0:enforce (display-info) @ uno-choice ---
    [INFO] Ignoring requireUpperBoundDeps in javax.servlet:servlet-api
    [INFO]
    [INFO] --- maven-enforcer-plugin:3.0.0:enforce (no-snapshots-in-release) @ uno-choice ---
    [INFO]
    [INFO] --- gmavenplus-plugin:1.13.1:addTestSources (test-in-groovy) @ uno-choice ---
    [INFO]
    [INFO] --- localizer-maven-plugin:1.31:generate (default) @ uno-choice ---
    [INFO]
    [INFO] --- maven-resources-plugin:3.2.0:resources (default-resources) @ uno-choice ---
    [INFO] Using 'UTF-8' encoding to copy filtered resources.
    [INFO] Using 'UTF-8' encoding to copy filtered properties files.
    [INFO] Copying 20 resources
    [INFO]
    [INFO] --- maven-compiler-plugin:3.8.1:compile (default-compile) @ uno-choice ---
    [INFO] Changes detected - recompiling the module!
    [INFO] Compiling 19 source files to /root/final/active-choices-plugin/target/classes
    [INFO] ------------------------------------------------------------------------
    [INFO] BUILD FAILURE
    [INFO] ------------------------------------------------------------------------
    [INFO] Total time: 4.645 s
    [INFO] Finished at: 2022-02-01T17:25:18Z

    [INFO] ------------------------------------------------------------------------

    constituent[0]: file:/root/apache-maven-3.8.4/conf/logging/
    constituent[1]: file:/root/apache-maven-3.8.4/lib/jcl-over-slf4j-1.7.32.jar
    constituent[2]: file:/root/apache-maven-3.8.4/lib/plexus-interpolation-1.26.jar
    constituent[3]: file:/root/apache-maven-3.8.4/lib/org.eclipse.sisu.plexus-0.3.5.jar
    constituent[4]: file:/root/apache-maven-3.8.4/lib/maven-plugin-api-3.8.4.jar
    constituent[5]: file:/root/apache-maven-3.8.4/lib/maven-resolver-api-1.6.3.jar
    constituent[6]: file:/root/apache-maven-3.8.4/lib/plexus-sec-dispatcher-2.0.jar
    constituent[7]: file:/root/apache-maven-3.8.4/lib/plexus-cipher-2.0.jar
    constituent[8]: file:/root/apache-maven-3.8.4/lib/maven-model-builder-3.8.4.jar
    constituent[9]: file:/root/apache-maven-3.8.4/lib/maven-resolver-impl-1.6.3.jar
    constituent[10]: file:/root/apache-maven-3.8.4/lib/maven-settings-3.8.4.jar
    constituent[11]: file:/root/apache-maven-3.8.4/lib/guice-4.2.2-no_aop.jar
    constituent[12]: file:/root/apache-maven-3.8.4/lib/maven-repository-metadata-3.8.4.jar
    constituent[13]: file:/root/apache-maven-3.8.4/lib/maven-model-3.8.4.jar
    constituent[14]: file:/root/apache-maven-3.8.4/lib/plexus-component-annotations-2.1.0.jar
    constituent[15]: file:/root/apache-maven-3.8.4/lib/org.eclipse.sisu.inject-0.3.5.jar
    constituent[16]: file:/root/apache-maven-3.8.4/lib/maven-shared-utils-3.3.4.jar
    constituent[17]: file:/root/apache-maven-3.8.4/lib/maven-compat-3.8.4.jar
    consti

    Exception in thread "main" java.lang.AssertionError
    at jdk.compiler/com.sun.tools.javac.util.Assert.error(Assert.java:155)
    at jdk.compiler/com.sun.tools.javac.util.Assert.check(Assert.java:46)
    at jdk.compiler/com.sun.tools.javac.comp.Modules.enter(Modules.java:247)
    at jdk.compiler/com.sun.tools.javac.main.JavaCompiler.readSourceFile(JavaCompiler.java:837)
    at jdk.compiler/com.sun.tools.javac.processing.JavacProcessingEnvironment$ImplicitCompleter.complete(JavacProcessingEnvironment.java:1535)
    at jdk.compiler/com.sun.tools.javac.code.Symbol.complete(Symbol.java:642)
    at jdk.compiler/com.sun.tools.javac.code.Symbol$ClassSymbol.complete(Symbol.java:1326)
    at jdk.compiler/com.sun.tools.javac.code.Type$ClassType.complete(Type.java:1140)
    at jdk.compiler/com.sun.tools.javac.code.Type$ClassType.getTypeArguments(Type.java:1066)
    at jdk.compiler/com.sun.tools.javac.code.Printer.visitClassType(Printer.java:237)
    at jdk.compiler/com.sun.tools.javac.code.Printer.visitClassType(Printer.java:52)
    at jdk.compiler/com.sun.tools.javac.code.Type$ClassType.accept(Type.java:993)
    at jdk.compiler/com.sun.tools.javac.code.Printer.visit(Printer.java:136)
    at jdk.compiler/com.sun.tools.javac.util.AbstractDiagnosticFormatter.formatArgument(AbstractDiagnosticFormatter.java:199)
    at jdk.compiler/com.sun.tools.javac.util.AbstractDiagnosticFormatter.formatArguments(AbstractDiagnosticFormatter.java:167)
    at jdk.compiler/com.sun.tools.javac.util.BasicDiagnosticFormatter.formatMessage(BasicDiagnosticFormatter.java:111)
    at jdk.compiler/com.sun.tools.javac.util.BasicDiagnosticFormatter.formatMessage(BasicDiagnosticFormatter.java:67)
    at jdk.compiler/com.sun.tools.javac.util.AbstractDiagnosticFormatter.formatArgument(AbstractDiagnosticFormatter.java:185)
    at jdk.compiler/com.sun.tools.javac.util.AbstractDiagnosticFormatter.formatArguments(AbstractDiagnosticFormatter.java:167)
    at jdk.compiler/com.sun.tools.javac.util.BasicDiagnosticFormatter.formatMessage(BasicDiagnosticFormatter.java:111)
    at jdk.compiler/com.sun.tools.javac.util.BasicDiagnosticFormatter.formatMessage(BasicDiagnosticFormatter.java:67)
    at jdk.compiler/com.sun.tools.javac.util.JCDiagnostic.getMessage(JCDiagnostic.java:788)
    at jdk.compiler/com.sun.tools.javac.api.ClientCodeWrapper$DiagnosticSourceUnwrapper.getMessage(ClientCodeWrapper.java:799)
    at org.codehaus.plexus.compiler.javac.JavaxToolsCompiler.compileInProcess(JavaxToolsCompiler.java:131)
    at org.codehaus.plexus.compiler.javac.JavacCompiler.performCompile(JavacCompiler.java:174)
    at org.apache.maven.plugin.compiler.AbstractCompilerMojo.execute(AbstractCompilerMojo.java:1134)
    at org.apache.maven.plugin.compiler.CompilerMojo.execute(CompilerMojo.java:187)
    at org.apache.maven.plugin.DefaultBuildPluginManager.executeMojo(DefaultBuildPluginManager.java:137)
    at org.apache.maven.lifecycle.internal.MojoExecutor.execute(MojoExecutor.java:210)
    at org.apache.maven.lifecycle.internal.MojoExecutor.execute(MojoExecutor.java:156)
    at org.apache.maven.lifecycle.internal.MojoExecutor.execute(MojoExecutor.java:148)
    at org.apache.maven.lifecycle.internal.LifecycleModuleBuilder.buildProject(LifecycleModuleBuilder.java:117)
    at org.apache.maven.lifecycle.internal.LifecycleModuleBuilder.buildProject(LifecycleModuleBuilder.java:81)
    at org.apache.maven.lifecycle.internal.builder.singlethreaded.SingleThreadedBuilder.build(SingleThreadedBuilder.java:56)
    at org.apache.maven.lifecycle.internal.LifecycleStarter.execute(LifecycleStarter.java:128)
    at org.apache.maven.DefaultMaven.doExecute(DefaultMaven.java:305)
    at org.apache.maven.DefaultMaven.doExecute(DefaultMaven.java:192)
    at org.apache.maven.DefaultMaven.execute(DefaultMaven.java:105)
    at org.apache.maven.cli.MavenCli.execute(MavenCli.java:972)
    at org.apache.maven.cli.MavenCli.doMain(MavenCli.java:293)
    at org.apache.maven.cli.MavenCli.main(MavenCli.java:196)
    at java.base/jdk.internal.reflect.NativeMethodAccessorImpl.invoke0(Native Method)
    at java.base/jdk.internal.reflect.NativeMethodAccessorImpl.invoke(NativeMethodAccessorImpl.java:62)
    at java.base/jdk.internal.reflect.DelegatingMetho
    Kris Stern
    @krisstern:matrix.org
    [m]
    I think it maybe a bug in your compiler: https://stackoverflow.com/q/62583298/9959070
    NehaMittal3010
    @NehaMittal3010
    if i make the Apache Maven 3.5.2 then ERROR changes to [ERROR] Failed to execute goal org.apache.maven.plugins:maven-enforcer-plugin:3.0.0:enforce (display-info) on project uno-choice: Some Enforcer rules have failed. Look above for specific messages explaining why the rule failed. -> [Help 1]