These are chat archives for jgamedev/nativescript

28th
Jul 2016
Gaseema Ndung'u
@Gaseema
Jul 28 2016 06:46
Hey guys
Trying to make the groceries app and i got this error:

FAILURE: Build failed with an exception.

  • What went wrong:
    Execution failed for task ':processF0DebugResources'.

    com.android.ide.common.process.ProcessException: org.gradle.process.internal.ExecException: Process 'command '/opt/android-sdk/build-tools/23.0.3/aapt'' finished with non-zero exit value 1