Where communities thrive


  • Join over 1.5M+ people
  • Join over 100K+ communities
  • Free without limits
  • Create your own community
People
Repo info
Activity
  • Feb 27 2020 15:09
    ordian labeled #11527
  • Feb 27 2020 15:09
    ordian opened #11527
  • Feb 27 2020 15:09
    ordian labeled #11527
  • Feb 27 2020 14:57
    niklasad1 closed #11508
  • Feb 27 2020 14:57
    niklasad1 commented #11508
  • Feb 27 2020 14:56
    niklasad1 labeled #11508
  • Feb 27 2020 14:38

    ordian on ao-github-actions

    initial github actions (compare)

  • Feb 27 2020 13:07
    s3krit synchronize #11525
  • Feb 27 2020 13:07

    s3krit on mp-de-parityify

    sed magic find . -type f -exec… (compare)

  • Feb 27 2020 12:57
    ordian labeled #11514
  • Feb 27 2020 12:57
    ordian unlabeled #11514
  • Feb 27 2020 12:56

    ordian on perf

    (compare)

  • Feb 27 2020 12:56

    ordian on master

    Faster kill_garbage (#11514) *… (compare)

  • Feb 27 2020 12:56
    ordian closed #11514
  • Feb 27 2020 11:22

    ordian on na-engine-signer-dont-use-msg-only-zeroes

    (compare)

  • Feb 27 2020 11:22

    ordian on master

    [EngineSigner]: don't sign mess… (compare)

  • Feb 27 2020 11:22
    ordian closed #11524
  • Feb 27 2020 11:22
    ordian closed #11521
  • Feb 27 2020 10:58
    niklasad1 synchronize #11524
  • Feb 27 2020 10:58

    niklasad1 on na-engine-signer-dont-use-msg-only-zeroes

    forgot formatting change (compare)

Amadeo Brands
@amadeobrands
hi
yavwa kelvin
@yavwa
any progress with this iisue?
byhashdong
@byhashdong
adfs
Aurijoy Majumdar
@aurijoy
@joshua-mir Are still actively mentoring mentees on substrate runtime, pallet development. Thanks!
Jam
@jam10o:matrix.org
[m]
@aurijoy: not actively but I'm open to giving folks pointers if they ask
I'm reachable on twitter or telegram @jam10o and this is my matrix account
Aurijoy Majumdar
@aurijoy
@jam10o:matrix.org thanks that would very helpful as well.
Hyungsuk Kang
@hskang9
I need to know lower value of gas limit computed in the estimateGas method
wonder2021
@wonder2021
url
how to add the url
Hyungsuk Kang
@hskang9
does anyone know the contract size limit of current ethereum mainnet?
liangzhongkai
@kct317
how to get tether usdt erc20 on kovan network?
BTCOFFICIALS
@BTCOFFICIALS_twitter
Teti2023 we are kindly sorry for not responding
you can kindly TEXT back for support
favealo
@favealo
Please binance lock me out of my account but i have ether in my account how can I recover them
kyungjun121
@kyungjun121
hi guys
i am novice
how can i install parity
on my macbook pro m1 max
favealo
@favealo
Hi
SunTeco
@SunTeco
Hello, everyone
SemyColon
@semycolon
WHERE IS THE DOCS?
i've been searching for an hour!
roninkaizen
@roninkaizen
maybe i can help
https://openethereum.github.io/
@semycolon
MichaelBrown0429
@MichaelBrown0429
Hello!
David Lee Ping
@davidlp94
hey guys!! im having issues installing parity - i receive an error when compiling the 'logos-derive' can anyone help??
Bing Yan
@bingy1234163
I got below error in openethereum as well as the old parity-etherem. Is it because I used an unexpected version software?
error[E0061]: this function takes 1 argument but 2 arguments were supplied
--> /Users/dianjunzhao/.cargo/registry/src/github.com-1ecc6299db9ec823/logos-derive-0.7.7/src/lib.rs:55:20
|
55 | extras.insert(util::ident(&ext), |_| panic!("Only one #[extras] attribute can be declared."));
| ^^^^^^ ----------------- ----------------------------------------------------------- supplied 2 arguments
| |
| expected 1 argument
|
note: associated function defined here
BlackMage2
@BlackMage2

i have the same error on my compile try(with Mac OS X 10.13.6, rustc 1.58.1, cargo 1.58.0):
Compiling vergen v3.0.4
error[E0061]: this function takes 1 argument but 2 arguments were supplied
--> /Users/user/.cargo/registry/src/github.com-1ecc6299db9ec823/logos-derive-0.7.7/src/lib.rs:55:20
|
55 | extras.insert(util::ident(&ext), |_| panic!("Only one #[extras] attribute can be declared."));
| ^^^^^^ ----------------- ----------------------------------------------------------- supplied 2 arguments
| |
| expected 1 argument
|
note: associated function defined here

error[E0061]: this function takes 1 argument but 2 arguments were supplied
--> /Users/user/.cargo/registry/src/github.com-1ecc6299db9ec823/logos-derive-0.7.7/src/lib.rs:89:23
|
89 | error.insert(variant, |_| panic!("Only one #[error] variant can be declared."));
| ^^^^^^ ------- -------------------------------------------------------- supplied 2 arguments
| |
| expected 1 argument
|
note: associated function defined here

error[E0061]: this function takes 1 argument but 2 arguments were supplied
--> /Users/user/.cargo/registry/src/github.com-1ecc6299db9ec823/logos-derive-0.7.7/src/lib.rs:93:21
|
93 | end.insert(variant, |_| panic!("Only one #[end] variant can be declared."));
| ^^^^^^ ------- ------------------------------------------------------ supplied 2 arguments
| |
| expected 1 argument
|
note: associated function defined here

Compiling rand v0.7.2
For more information about this error, try rustc --explain E0061.
error: could not compile logos-derive due to 3 previous errors
warning: build failed, waiting for other jobs to finish...
error: build failed

I hope someone knows the best way to fix this?

Ari
@auser
Hey ya'll... is openthereum/openthereum still under active development?
Everytime I try to export the blocks, I end up with a filesize of 0 openethereum export blocks --chain ropsten ./ropsten-blocks.rlp is the command I'm using, based on the docs. Does that work, at least?