Where communities thrive


  • Join over 1.5M+ people
  • Join over 100K+ communities
  • Free without limits
  • Create your own community
People
Repo info
Activity
    Sai Krishna
    @saikrishna321
    take screenshot for every action ? why when u have video ?
    Vinícius S. Pazzini
    @VPazzini
    @saikrishna321 I tried recording the test execution, but no videos were recorded
    Sai Krishna
    @saikrishna321
    @VPazzini any error ? have u installed flick on your machine
    ?
    @/all we are updating the ReadMe with the organizations who are using our framework, can you folks please ping me if you think your org can be mentioned in the page
    eyalpartner
    @eyalpartner
    Hi, I need help with running AppiumParallelTests
    Can someone help please ?
    eyalpartner
    @eyalpartner
    java.lang.ClassCastException: Android.ifsTests cannot be cast to com.appium.manager.AppiumParallelTest
    at com.appium.manager.AppiumParallelTest.onTestStart(AppiumParallelTest.java:508)
    at org.testng.internal.TestListenerHelper.runTestListeners(TestListenerHelper.java:73)
    at org.testng.internal.Invoker.runTestListeners(Invoker.java:1389)
    at org.testng.internal.Invoker.invokeMethod(Invoker.java:559)
    at org.testng.internal.Invoker.invokeTestMethod(Invoker.java:719)
    at org.testng.internal.Invoker.invokeTestMethods(Invoker.java:989)
    at org.testng.internal.TestMethodWorker.invokeTestMethods(TestMethodWorker.java:125)
    at org.testng.internal.TestMethodWorker.run(TestMethodWorker.java:109)
    at java.util.concurrent.ThreadPoolExecutor.runWorker(ThreadPoolExecutor.java:1149)
    at java.util.concurrent.ThreadPoolExecutor$Worker.run(ThreadPoolExecutor.java:624)
    at java.lang.Thread.run(Thread.java:748)
    eyalpartner
    @eyalpartner
    seems that I can't use keycode events from AndroidElement because your code has only AppiumDriver, Can you do something ?
    Sai Krishna
    @saikrishna321
    how does ur code look like?
    Sunil Patro
    @sunilpatro1985
    Hi @saikrishna321 Thanks for the awesome framework, I have an app which is bit different in navigations for both ios and android, so I am planning to keep separate page object and tests for android and ios, can I still use this framework?
    Carmine Vassallo
    @carminevassallo
    Dear @/all AppiumTestDistribution developers,
    I’m Carmine, a researcher at the University of Zurich and I am interested in supporting developers working with continuous integration (CI). I created a reporting tool that analyzes the CI logs of a project to identify deviations from accepted CI best practices.
    For example, are you aware that your last changes on branch "CI" happened 23 weeks ago, and have not been merged back to the master yet? In your project, you typically merge branches on weekly basis.
    You will find this and other interesting statistics about the CI practices in your project at https://carminevassallo.github.io/detectorsIcons/summarizer-output/saikrishna321_AppiumTestDistribution/saikrishna321_AppiumTestDistribution.html
    I would really appreciate if you could find the time to give me some feedback on the report that I generated for you or on my tool. Please fill out the following survey http://www.surveygizmo.com/s3/4515476/Summarizing-the-Continuous-Integration-Process
    It usually takes 7 minutes (10 minutes at maximum). As a little encouragement, we will raffle off a 50$ Amazon voucher among all participants.
    Thank you for your time! Your feedback is crucial for my research!
    Sai Krishna
    @saikrishna321
    @sunilpatro1985 you can keep single framework for that
    the sample also has different navigation for ios and android but still single test
    Sunil Patro
    @sunilpatro1985
    @saikrishna321 Sure, will take a look at the code, Thanks
    Shawn Edge
    @Edge-Man
    Hello! is anyone on?
    johnson are
    @lummyare
    Hi Everyone. I am new to Appium as i have been using Calabash for long and i just started work where they use only Appium. Could help me only configure this AppoiumTestDistribution or PageObjectPatternAppium to work on my iOs and Andorid app. I dont mind to pay for your effort if you could help me set the framework to work for my apps and run 1 test for landing page to confirm it works. Please here is my email lummyare@gmail.com incase anyone is willing to help and get paid for it. I am sorry if tyhis violates the rules of the chat room but i am really desperate and almost about to lose my job. All i need is to help set this great framework to use my iOS and Andorid app. Thanks
    Shawn Edge
    @Edge-Man
    @lummyare : I haven't used this framework but may I ask why do you need to use it? , You should be able to get your tests running without the framework. This framework however does provide functionality to use with Cucumber and Parallel and Distributed testing. Feel free to DM me if needed I should be able to help for free.
    Gopinath
    @vsgopinath
    Can you anyone list down the steps to run the sample project by Cucumber Tests. I followed the steps in the ReadMe.MD ,its not running the test instead it starts server then shows build success.
    Sai Krishna
    @saikrishna321
    @vsgopinath can u try the sample project https://github.com/saikrishna321/PageObjectPatternAppium
    Gopinath
    @vsgopinath
    @saikrishna321 I tried the above mentioned sample project.TestNG framework is running perfectly. But for cucumber, i tried running using the maven goals validate and clean -Dtest=RunnerCukes test . But it's just starting the appium server and stopped immediately showing "BUILD SUCCESS". I am very new for this cucumber jvm parallel plugin and appium.
    Gopinath
    @vsgopinath
    @saikrishna321 I am getting the below message in console :
    image.png
    Gopinath
    @vsgopinath
    @saikrishna321 Am I missing anything here ?. Coz I followed the steps mentioned in the ReadMe.
    Sai Krishna
    @saikrishna321
    R u running the sample project? If yes can u check if the RunnerCukes is TestNg runner
    Gopinath
    @vsgopinath
    @saikrishna321 Yeah. Even I modified the import to TestNG.annotations, I am still getting the "same message" as mentioned above. And for some reason, I can not able to see the code in the class files of AppiumTestDistribution. I could see the "parallel.xml"(testNG test suite) file is created in the target folder. Any suggestions ?
    Gopinath
    @vsgopinath
    @saikrishna321 I am able to resolve this issue now. And the cucumber tests are running parallel now. The issue is with the eclipse "M2E" connector as it's ignoring the plugin goal of that cucumber jvm parallel plugin. I got the issue resolved when i ran the same project in IntelliJ. Thanks for the help :)
    johnson are
    @lummyare
    @vsgopinath please could you share the steps you followed to fix this issue as I had same issue as well. Please help share details. Thanks
    Gopinath
    @vsgopinath
    @lummyare Don't use eclipse. Use IntelliJ by JetBrains.The project will run without any errors or warnings.If you still want to use Eclipse, you might need to change the default "M2E" connector.
    johnson are
    @lummyare
    Ok thanks
    Gopinath
    @vsgopinath
    @saikrishna321 Is there any way to get the cucumber.json files for the parallely executed features ? This will help to generate report using other tools.
    Rajesh Kumar Chaudhary
    @rajeshchy
    @saikrishna321 Hi, is it possible to run parallelly on different mobile devices using selenium grid?
    Gopinath
    @vsgopinath
    @saikrishna321 For some reason the reports are not generated by Masterthought.
    António Carvalho
    @antoniomapc_twitter
    hello, anyone there?
    :)
    dez 10, 2018 5:10:44 PM com.appium.manager.DeviceAllocationManager getDevices INFO: All devices connected creating directory: ADBLogs SLF4J: Failed to load class "org.slf4j.impl.StaticLoggerBinder". SLF4J: Defaulting to no-operation (NOP) logger implementation SLF4J: See http://www.slf4j.org/codes.html#StaticLoggerBinder for further details. Tests run: 1, Failures: 1, Errors: 0, Skipped: 0, Time elapsed: 2.317 sec <<< FAILURE! testRunner(tests.Runner) Time elapsed: 1.962 sec <<< FAILURE! com.epam.reportportal.exception.InternalReportPortalClientException: Cannot build ReportPortal client
    I have the following error
    can I disable report portal or something?
    Sai Krishna
    @saikrishna321
    yah we have fix for this in master
    @antoniomapc_twitter

    <dependency>
    <groupId>com.github.saikrishna321</groupId>
    <artifactId>AppiumTestDistribution</artifactId>
    <version> 1f4a3e6426 </version>
    </dependency>

    <repositories>
    <repository>
    <id>jitpack.io</id>
    <url>https://jitpack.io</url>
    </repository>
    </repositories>

    Gopinath
    @vsgopinath
    @saikrishna321 I am trying to run the sample project to check the report generation but I am getting the below error now :
    image.png
    I am using Java Version : 1.8.0_181-b13 AppiumTestDistribution Version : 9.1.0
    Sai Krishna
    @saikrishna321
    looks like u have some dependency clash