Where communities thrive


  • Join over 1.5M+ people
  • Join over 100K+ communities
  • Free without limits
  • Create your own community
People
Repo info
Activity
  • Jul 17 2020 23:41
    ugurcandede closed #378
  • Jul 17 2020 23:41
    ugurcandede closed #379
  • May 31 2020 16:06
    pinkasey closed #287
  • May 31 2020 16:06
    pinkasey commented #287
  • Mar 21 2020 07:45
    flachica closed #354
  • Feb 13 2019 13:30
    StefanOid commented #409
  • Feb 13 2019 13:06
    Prabhat36 commented #409
  • Jan 31 2019 23:07
    StefanOid opened #409
  • Nov 24 2018 12:52
    pinkasey commented #408
  • Nov 24 2018 12:50
    pinkasey closed #408
  • Nov 24 2018 12:47
    pinkasey opened #408
  • Oct 07 2018 00:03
    hakangoker opened #407
  • Sep 30 2018 16:45
    Prabhat36 commented #406
  • Sep 16 2018 11:26
    donroyco opened #406
  • Aug 09 2018 18:46
    lucasa commented #402
  • Jul 23 2018 01:59
    isaacjoe commented #405
  • Jul 13 2018 08:12
    isaacjoe commented #403
  • Jul 13 2018 08:07
    isaacjoe commented #377
  • Jul 05 2018 18:19
    mekjr1 commented #321
  • Jul 05 2018 18:15
    mekjr1 commented #404
lidzen
@lidzen
ok
Sakitha
@Sakitha
does anyone know whats wrong with these functions, i tried to run it within a callback function responsible for rendering the option interface of a setting field ( im trying to display post’s index numbers of a public facebook page in a custom admin menu )
add_settings_field(
'post_id_feed',                      // ID used to identify the field throughout the theme
'Post id feed',                      // The label to the left of the option interface element
'fb_post_id_callback',   // The name of the function responsible for rendering the option interface
'fb_feed_display_options',        // The page on which this option will be displayed
'general_settings_section'   // The name of the section to which this field belong
);
function fb_post_id_callback() {
function make_fb_request(){

$url = 'https://graph.facebook.com/v2.12/saifa.uoc.science/feed?access_token=#mytoken';

$response = wp_remote_get( $url );
try {
$json = json_decode( $response['body'] );
} catch ( Exception $ex ) {
$json = null;
}
return $json;
};
$json_to_array=make_fb_request();

foreach ( $json_to_array['data'] as $post) { ?>
<label>
<input type="checkbox" value="<?echo $post['id'] ?>" name="fb_feed_display_options[post_id_feed]" <?php echo (in_array($post['id'],get_option('fb_feed_display_options[post_id_feed]')) ? 'checked = checked':" ") ; ?> />
<?php echo $post['id']; ?>
</label>

<?php };
};
Moiz5251
@Moiz5251
Hello Everyone
visual composer stretch class is not working
automatically disabled Pls help me..
Omos Aziegbe
@OAziegbe_twitter
@shprink Please can you help me with this? I have been trying this for days but no success. After run the yarn command and running npm start on my windows system, I get Failed to load index.html.
the full stack trace is

$ npm start

wordpress-hybrid-client@3.0.0-alpha03 start C:\Development\afrokizzmeApp
npm run ionic:start

npm WARN invalid config loglevel="notice"

wordpress-hybrid-client@3.0.0-alpha03 ionic:start C:\Development\afrokizzmeApp
ionic serve

Starting app-scripts server: --address 0.0.0.0 --port 8100 --livereload-port 35729 --dev-logger-port 53703 --nobrowser - Ctrl+C to cancel
[17:50:34] watch started ...
[17:50:34] build dev started ...
[17:50:34] clean started ...
[17:50:34] clean finished in less than 1 ms
[17:50:34] copy started ...
[17:50:34] deeplinks started ...
[17:50:34] deeplinks finished in 15 ms
[17:50:34] transpile started ...
[17:50:40] typescript: C:/Development/afrokizzmeApp/src/i18n/index.ts, line: 2
Cannot find name 'require'.

   L1:  try {
   L2:    require.context("./", true, /^\.\/.*\.cson$/)
   L3:  } catch (error) {

[17:50:40] typescript: C:/Development/afrokizzmeApp/src/providers/config.ts, line: 8
Cannot find name 'require'.

   L8:  const configOverwrite = require('../../config/config.cson');

[17:50:40] typescript: C:/Development/afrokizzmeApp/src/providers/menu.ts, line: 2
Cannot find name 'require'.

   L1:  import { Injectable } from '@angular/core';
   L2:  const menu = require('../../config/menu.json');

[17:50:40] typescript: C:/Development/afrokizzmeApp/src/reducers/bookmarks.spec.ts, line: 10
Cannot find name 'describe'.

  L10:  describe('bookmarksReducer reducer', () => {
  L11:      it('should return the initial state with UNKNOWN, CLEAN_CACHE and INIT actions', () => {

[17:50:40] typescript: C:/Development/afrokizzmeApp/src/reducers/bookmarks.spec.ts, line: 11
Cannot find name 'it'.

  L10:  describe('bookmarksReducer reducer', () => {
  L11:      it('should return the initial state with UNKNOWN, CLEAN_CACHE and INIT actions', () => {
  L12:          expect(

[17:50:40] typescript: C:/Development/afrokizzmeApp/src/reducers/bookmarks.spec.ts, line: 12
Cannot find name 'expect'.

  L11:  it('should return the initial state with UNKNOWN, CLEAN_CACHE and INIT actions', () => {
  L12:      expect(
  L13:          bookmarksReducer(undefined, { type: 'UNKNOWN' })

[17:50:40] typescript: C:/Development/afrokizzmeApp/src/reducers/bookmarks.spec.ts, line: 15
Cannot find name 'expect'.

  L14:  ).toEqual(DEFAULT_STATE);
  L15:  expect(
  L16:      bookmarksReducer(undefined, { type: CLEAN_CACHE })

[17:50:40] typescript: C:/Development/afrokizzmeApp/src/reducers/bookmarks.spec.ts, line: 18
Cannot find name 'expect'.

  L17:  ).toEqual(DEFAULT_STATE);
  L18:  expect(
  L19:      bookmarksReducer(undefined, { type: INIT })

[17:50:40] typescript: C:/Development/afrokizzmeApp/src/reducers/bookmarks.spec.ts, line: 23
Cannot find name 'it'.

  L23:      it('should ADD_BOOKMARK/REMOVE_BOOKMARK properly', () => {
  L24:          const state1 = bookmarksReducer(DEFAULT_STATE, {

[17:50:40] typescript: C:/Development/afrokizzmeApp/src/reducers/bookmarks.spec.ts, line: 34
Cannot find name 'expect'.

  L34:          expect(state1).toEqual({
  L35:              'posts:2585': {

[17:50:40] typescript: C:/Development/afrokizzmeApp/src/reducers/bookmarks.spec.ts, line: 49
Cannot find name 'expect'.

  L49:          expect(state2).toEqual(DEFAULT_STATE);
  L50:      });

[17:50:40] typescript: C:/Development/afrokizzmeApp/src/reducers/bookmarks.spec.ts, line: 52
Cannot find name 'it'.

  L52:      it('should REMOVE_BOOKMARKS properly', () => {
  L53:          const state1 = bookmarksReducer(DEFAULT_STATE, {

[17:50:40] typescript: C:/Development/afrokizzmeApp/src/reducers/bookmarks.spec.ts, line: 73
Cannot find name 'expect'.

  L73:          expect(state2).toEqual({
  L74:              'posts:1': {

[17:50:40] typescript: C:/Development/afrokizzmeApp/src/reducers/bookmark

please how to resolve this? I cant find index.html on the src/ folder so therefore there is no www/index.html too
Raju Shetty
@RajuShetty
Can someone just set this app for my wordpress recipe site? Please let me know the charges
Omos Aziegbe
@OAziegbe_twitter
@OAziegbe_twitter For anybody having this problem, I solved this through 1. npm install --save @types/node 2. yarn add @types/node and finally in your tsconfig.json add "typeRoots": [ "node_modules/@types" ], in your "compilerOptions":
Diana Joanita
@LadyDianaJoan_twitter
hello, am new to wordpress i would like to be guided on how to start building your application using wordpress website for free
Ali
@uxdom

Hi @kostar how were you able to implement this?

anyone tried to enable Push subscriptions for different Categories or tags? I need my client to subscribe to 3 out of 5 categories. How to build it into app?

Omos Aziegbe
@OAziegbe_twitter
@RajuShetty Still need help setting up your site?
Omos Aziegbe
@OAziegbe_twitter
@LadyDianaJoan_twitter Have u tried following the documentation on here..https://wordpress-clients.gitbooks.io/pwa-hybrid/
Francisco Sanz
@frasanz
Hello. Any documentation on how to build android production release?
Omos Aziegbe
@OAziegbe_twitter
@frasanz , have you seen this yet? https://github.com/alhazmy13/wordpress-hybrid-client/blob/develop/RELEASE.md . it could be of help..
zaylon
@zaylon
Hello all , may i ask wich IDE you use ? what you advice me to use ? thanks .
Casey Lessard
@caseylessard
@frasanz I used Adobe Phonegap Build and it made my life much easier.
Omos Aziegbe
@OAziegbe_twitter
@zaylon , I use the Netbeans IDE. You just have to add additional plugins. (Typescript plugin for Netbeans and Ionic Plugin for Netbeans). You can google search them.
Ahmet Özcan
@ahmetozcan9211
hi i need some help somebody can help me?
Omos Aziegbe
@OAziegbe_twitter
@ahmetozcan9211 , hey what help do you need? let me see if I can offer something
Ahmet Özcan
@ahmetozcan9211
hey anobody there
i want change default page to posts
how can i do it?
Omos Aziegbe
@OAziegbe_twitter
@ahmetozcan9211 , you can do that by opening config.cson and setting the default page to post like this
defaultPage: "page": "posts"
Ahmet Özcan
@ahmetozcan9211
hi i have an error while run npm run run:ios

Users/ahmet/Library/Developer/Xcode/DerivedData/YourAppName-ezlotygcezmobhcjbuxrsnkhsbvt/Build/Intermediates.noindex/YourAppName.build/Debug-iphonesimulator/YourAppName.build/Objects-normal/x86_64/YourAppName_dependency_info.dat -o /Users/ahmet/Desktop/trial/platforms/ios/build/emulator/YourAppName.app/YourAppName
duplicate symbol _OBJCCLASS$_CDVLogger in:
/Users/ahmet/Library/Developer/Xcode/DerivedData/YourAppName-ezlotygcezmobhcjbuxrsnkhsbvt/Build/Intermediates.noindex/YourAppName.build/Debug-iphonesimulator/YourAppName.build/Objects-normal/x86_64/CDVLogger.o
/Users/ahmet/Desktop/trial/platforms/ios/build/emulator/libCordova.a(CDVLogger.o)
duplicate symbol _OBJCMETACLASS$_CDVLogger in:
/Users/ahmet/Library/Developer/Xcode/DerivedData/YourAppName-ezlotygcezmobhcjbuxrsnkhsbvt/Build/Intermediates.noindex/YourAppName.build/Debug-iphonesimulator/YourAppName.build/Objects-normal/x86_64/CDVLogger.o
/Users/ahmet/Desktop/trial/platforms/ios/build/emulator/libCordova.a(CDVLogger.o)
ld: 2 duplicate symbols for architecture x86_64
clang: error: linker command failed with exit code 1 (use -v to see invocation)

BUILD FAILED

The following build commands failed:
Ld build/emulator/YourAppName.app/YourAppName normal x86_64
(1 failure)
Error: Error code 65 for command: xcodebuild with args: -xcconfig,/Users/ahmet/Desktop/trial/platforms/ios/cordova/build-debug.xcconfig,-workspace,YourAppName.xcworkspace,-scheme,YourAppName,-configuration,Debug,-sdk,iphonesimulator,-destination,platform=iOS Simulator,name=iPhone X,build,CONFIGURATION_BUILD_DIR=/Users/ahmet/Desktop/trial/platforms/ios/build/emulator,SHARED_PRECOMPS_DIR=/Users/ahmet/Desktop/trial/platforms/ios/build/sharedpch

Ahmet Özcan
@ahmetozcan9211
i have error dublicate symbols. at xcdoe i see that details
Ahmet Özcan
@ahmetozcan9211

Ld /Users/ahmet/Library/Developer/Xcode/DerivedData/YourAppName-bwxrptthedixcjcvzwybeliinfmv/Build/Products/Debug-iphonesimulator/YourAppName.app/YourAppName normal x86_64
cd /Users/ahmet/deneme45/platforms/ios
export IPHONEOS_DEPLOYMENT_TARGET=9.1
export PATH="/Applications/Xcode.app/Contents/Developer/Platforms/iPhoneSimulator.platform/Developer/usr/bin:/Applications/Xcode.app/Contents/Developer/usr/bin:/usr/local/bin:/usr/bin:/bin:/usr/sbin:/sbin"
/Applications/Xcode.app/Contents/Developer/Toolchains/XcodeDefault.xctoolchain/usr/bin/clang -arch x86_64 -isysroot /Applications/Xcode.app/Contents/Developer/Platforms/iPhoneSimulator.platform/Developer/SDKs/iPhoneSimulator11.2.sdk -L/Users/ahmet/Library/Developer/Xcode/DerivedData/YourAppName-bwxrptthedixcjcvzwybeliinfmv/Build/Products/Debug-iphonesimulator -F/Users/ahmet/Library/Developer/Xcode/DerivedData/YourAppName-bwxrptthedixcjcvzwybeliinfmv/Build/Products/Debug-iphonesimulator -filelist /Users/ahmet/Library/Developer/Xcode/DerivedData/YourAppName-bwxrptthedixcjcvzwybeliinfmv/Build/Intermediates.noindex/YourAppName.build/Debug-iphonesimulator/YourAppName.build/Objects-normal/x86_64/YourAppName.LinkFileList -Xlinker -rpath -Xlinker @executable_path/Frameworks -mios-simulator-version-min=9.1 -dead_strip -Xlinker -object_path_lto -Xlinker /Users/ahmet/Library/Developer/Xcode/DerivedData/YourAppName-bwxrptthedixcjcvzwybeliinfmv/Build/Intermediates.noindex/YourAppName.build/Debug-iphonesimulator/YourAppName.build/Objects-normal/x86_64/YourAppName_lto.o -Xlinker -no_deduplicate -Xlinker -objc_abi_version -Xlinker 2 -fobjc-arc -fobjc-link-runtime -ObjC -Xlinker -sectcreate -Xlinker TEXT -Xlinker entitlements -Xlinker /Users/ahmet/Library/Developer/Xcode/DerivedData/YourAppName-bwxrptthedixcjcvzwybeliinfmv/Build/Intermediates.noindex/YourAppName.build/Debug-iphonesimulator/YourAppName.build/YourAppName.app.xcent /Users/ahmet/Library/Developer/Xcode/DerivedData/YourAppName-bwxrptthedixcjcvzwybeliinfmv/Build/Products/Debug-iphonesimulator/libCordova.a -lz -weak_framework WebKit -weak_framework Social -weak_framework MessageUI -framework QuartzCore -Xlinker -dependency_info -Xlinker /Users/ahmet/Library/Developer/Xcode/DerivedData/YourAppName-bwxrptthedixcjcvzwybeliinfmv/Build/Intermediates.noindex/YourAppName.build/Debug-iphonesimulator/YourAppName.build/Objects-normal/x86_64/YourAppName_dependency_info.dat -o /Users/ahmet/Library/Developer/Xcode/DerivedData/YourAppName-bwxrptthedixcjcvzwybeliinfmv/Build/Products/Debug-iphonesimulator/YourAppName.app/YourAppName

duplicate symbol _OBJCIVAR$_CDVWKWebViewEngine._engineWebView in:
/Users/ahmet/Library/Developer/Xcode/DerivedData/YourAppName-bwxrptthedixcjcvzwybeliinfmv/Build/Intermediates.noindex/YourAppName.build/Debug-iphonesimulator/YourAppName.build/Objects-normal/x86_64/CDVWKWebViewEngine-FF81F419361B738.o
/Users/ahmet/Library/Developer/Xcode/DerivedData/YourAppName-bwxrptthedixcjcvzwybeliinfmv/Build/Intermediates.noindex/YourAppName.build/Debug-iphonesimulator/YourAppName.build/Objects-normal/x86_64/CDVWKWebViewEngine-FC3D2128C9C416AD.o
duplicate symbol _OBJCIVAR$_CDVWKWeakScriptMessageHandler._scriptMessageHandler in:
/Users/ahmet/Library/Developer/Xcode/DerivedData/YourAppName-bwxrptthedixcjcvzwybeliinfmv/Build/Intermediates.noindex/YourAppName.build/Debug-iphonesimulator/YourAppName.build/Objects-normal/x86_64/CDVWKWebViewEngine-FF81F419361B738.o
/Users/ahmet/Library/Developer/Xcode/DerivedData/YourAppName-bwxrptthedixcjcvzwybeliinfmv/Build/Intermediates.noindex/YourAppName.build/Debug-iphonesimulator/YourAppName.build/Objects-normal/x86_64/CDVWKWebViewEngine-FC3D2128C9C416AD.o
duplicate symbol _OBJCIVAR$_CDVWKWebViewEngine._weakScriptMessageHandler in:
/Users/ahmet/Library/Developer/Xcode/DerivedData/YourAppName-bwxrptthedixcjcvzwybeliinfmv/Build/Intermediates.noindex/YourAppName.build/Debug-iphonesimulator/YourAppName.build/Objects-normal/x86_64/CDVWKWebViewEngine-FF81F419361B738.o
/Users/ahmet/Library/Developer/Xcode/DerivedData/YourAppName-bwxrptthedixcjcvzwybeliinfmv

dimejdrzer
@dimejdrzer
Hello, anyone here?
praveen123
@praveen123
Hi, I need some help in multisite set up
There are 2 sites set up site1.example.com and example.com
How can make site1.example.com to use nfmr_3_options and example.com to use nfmr_4_options tables
Both are using same database with table prefixed but not sure how to make use of different tables for different sites
Rob
@s31181
Noob question: if i change a category name, just the name and not the slug, will it effect the links associated with the category? or will it just replace the name on the front end?
Marjan Panić
@neoartdoo
so is chat working or not? i see lot of question and no answers!
wildwolf1991
@wildwolf1991
Hi,everyone
Could you please explain how to use whatshelp plugin in wordpress?
@s31181 Hi Rob
Could you please answer my question?
@OAziegbe_twitter hi
Could you please answer my question?
@shprink Hi, could you please answer my question?
Eyal Pinkas
@pinkasey
Hey guys, just an insight -
No one owes you anything. You didn't pay for wphc, no one says shprink must answer your question. It could have been nice if a community would have emerged from this project, and ppl would help each other (including me), but since ive been on this room i didnt see that happening. Only shprink answers questions, from time to time, afaik on his spare time. Or maybe i missed it.
I wish i had better understanding, so I could help others too.
Omos Aziegbe
@OAziegbe_twitter
@wildwolf1991 hi, Sorry I have never used the whatshelp plugin, but you can contact the author of the plugin for help and documentation. You can also look for help in the plugin page on the plugin directory
Abdul Gafar Manuel Meque
@mekjr1
Hi guys,
can any of you help me with the following errors?
src/providers/config.ts(6,27): error TS2307: Cannot find module '../config.default.cson'.
src/providers/config.ts(19,13): error TS2304: Cannot find name 'DEV'.
Eyal Pinkas
@pinkasey

has anyone here successfully build a production APK of v3?
I ran into A LOT of problems along the way, solved them and ran into new ones.
My guess is that It all started because I installed newer version of Android SDK, which made me update some other versions, which broke some other modules...

So, if anyone made it to a working APK, and can share, that would be great.

Abdul Gafar Manuel Meque
@mekjr1
Maybe you should have tried to keep all the platforms. i.e keep all the previous versions, android development platforms. And set your IDE to automatically detect the appropriate version for the build. My build ran without problems. I am still facing problems with building the "packs" tho...